null
SMILES: N(c1n[nH]c2cccnc12)c1ccc2ccncc2c1
InChI Key: InChIKey=TWNMJRDGUZTHLI-UHFFFAOYSA-N
Activity Spreadsheet -- Enzyme Inhibition Constant Data from BindingDB
Found 1 hit for monomerid = 50148374
Trg + Lig
Ki
nM
ΔG°
kcal/mole
IC50
nM
Kd
nM
EC50/IC50
nM
koff
s-1
kon
M-1s-1
pHTemp
°C
Metabotropic glutamate receptor 4
(Homo sapiens (Human))
BDBM50148374
(CHEMBL4760038)
Show SMILES N(c1n[nH]c2cccnc12)c1ccc2ccncc2c1
Show InChI InChI=1S/C22H24N2O4S/c1-23-13-16(14-7-8-17(27-2)18(11-14)28-3)20-15(21(23)25)12-19(29-20)22(26)24-9-5-4-6-10-24/h7-8,11-13H,4-6,9-10H2,1-3H3
n/an/an/an/a>1.00E+4n/an/an/an/a
TBA
Assay Description
Inhibition of human urine urokinase using L-PyroGlu-Gly-Arg-pNA.HCl substrate at 5 uM
Citation and Details
Article DOI: 10.1016/j.bmcl.2018.10.050
BindingDB Entry DOI: 10.7270/Q2MG7T2H