BDBM50148385 CHEMBL3770949
SMILES: Cn1cc(-c2cccc(c2)C(F)(F)F)c2sc(cc2c1=O)C(=N)NC1CCS(=O)(=O)CC1
InChI Key: InChIKey=UCISVEKCUIGBJX-UHFFFAOYSA-N
Data: 2 IC50
PDB links: 1 PDB ID matches this monomer.
Activity Spreadsheet -- Enzyme Inhibition Constant Data from BindingDB
Found 1 hit for monomerid = 50148385
Trg + Lig
Ki
nM
ΔG°
kcal/mole
IC50
nM
Kd
nM
EC50/IC50
nM
koff
s-1
kon
M-1s-1
pHTemp
°C
Metabotropic glutamate receptor 4
(Homo sapiens (Human))
BDBM50148385
(CHEMBL4753444)
Show SMILES Cn1cc(-c2cccc(c2)C(F)(F)F)c2sc(cc2c1=O)C(=N)NC1CCS(=O)(=O)CC1
Show InChI InChI=1S/C21H20F3N3O3S2/c1-27-11-16(12-3-2-4-13(9-12)21(22,23)24)18-15(20(27)28)10-17(31-18)19(25)26-14-5-7-32(29,30)8-6-14/h2-4,9-11,14H,5-8H2,1H3,(H2,25,26)
n/an/an/an/a>1.00E+4n/an/an/an/a
TBA
Assay Description
Inhibition of human urine urokinase using L-PyroGlu-Gly-Arg-pNA.HCl substrate at 5 uM
Citation and Details