BDBM50148462 CHEMBL3770886
SMILES: CC(C)c1ccc(cc1)S(=O)(=O)Nc1ccc2n(C)c(=O)n(C)c2c1
InChI Key: InChIKey=NTEOEJNZLOGVBX-UHFFFAOYSA-N
Data: 3 IC50
Activity Spreadsheet -- Enzyme Inhibition Constant Data from BindingDB
Found 3 hits for monomerid = 50148462
Trg + Lig
Ki
nM
ΔG°
kcal/mole
IC50
nM
Kd
nM
EC50/IC50
nM
koff
s-1
kon
M-1s-1
pHTemp
°C
Transcription intermediary factor 1-alpha
(Homo sapiens (Human))
BDBM50148462
(CHEMBL3770886)
Show SMILES CC(C)c1ccc(cc1)S(=O)(=O)Nc1ccc2n(C)c(=O)n(C)c2c1
Show InChI InChI=1S/C18H21N3O3S/c1-12(2)13-5-8-15(9-6-13)25(23,24)19-14-7-10-16-17(11-14)21(4)18(22)20(16)3/h5-12,19H,1-4H3
n/an/a 3.45E+3n/an/an/an/an/an/a
University of Oxford
Curated by ChEMBL
Assay Description
Inhibition of N-terminal His6-SUMO-1-tagged recombinant human TRIM24 bromodomain expressed in Escherichia coli BL21(DE3)-R3-pRARE2 cells by Alpha Scr...
J Med Chem 59: 1642-7 (2016)
BindingDB Entry DOI: 10.7270/Q2JS9S9G
Bromodomain-containing protein 1
(Homo sapiens (Human))
BDBM50148462
(CHEMBL3770886)
Show SMILES CC(C)c1ccc(cc1)S(=O)(=O)Nc1ccc2n(C)c(=O)n(C)c2c1
Show InChI InChI=1S/C18H21N3O3S/c1-12(2)13-5-8-15(9-6-13)25(23,24)19-14-7-10-16-17(11-14)21(4)18(22)20(16)3/h5-12,19H,1-4H3
n/an/a 4.30E+3n/an/an/an/an/an/a
University of Oxford
Curated by ChEMBL
Assay Description
Inhibition of BRPF2 BRD1 (unknown origin) by Alpha Screen assay
J Med Chem 59: 1642-7 (2016)
BindingDB Entry DOI: 10.7270/Q2JS9S9G
Peregrin
(Homo sapiens (Human))
BDBM50148462
(CHEMBL3770886)
Show SMILES CC(C)c1ccc(cc1)S(=O)(=O)Nc1ccc2n(C)c(=O)n(C)c2c1
Show InChI InChI=1S/C18H21N3O3S/c1-12(2)13-5-8-15(9-6-13)25(23,24)19-14-7-10-16-17(11-14)21(4)18(22)20(16)3/h5-12,19H,1-4H3
n/an/a 420n/an/an/an/an/an/a
University of Oxford
Curated by ChEMBL
Assay Description
Inhibition of BRPF1B (unknown origin) by Alpha Screen assay
J Med Chem 59: 1642-7 (2016)
BindingDB Entry DOI: 10.7270/Q2JS9S9G