BDBM50148494 CHEMBL119070::N-(3-Aminomethyl-phenyl)-2-[(S)-2-hydroxy-2-((R)-4-hydroxy-3-methanesulfonylamino-phenyl)-ethylamino]-2-(4-methoxy-phenyl)-propionamide
SMILES: COc1ccc(cc1)[C@](C)(NC[C@H](O)c1ccc(O)c(NS(C)(=O)=O)c1)C(=O)Nc1cccc(CN)c1
InChI Key: InChIKey=IWNSJKLSAWLPNI-AHWVRZQESA-N
Data: 1 KI  1 EC50
Activity Spreadsheet -- Enzyme Inhibition Constant Data from BindingDB
Found 2 hits for monomerid = 50148494
Trg + Lig
Ki
nM
ΔG°
kcal/mole
IC50
nM
Kd
nM
EC50/IC50
nM
koff
s-1
kon
M-1s-1
pHTemp
°C
Beta-3 adrenergic receptor
(Homo sapiens (Human))
BDBM50148494
(CHEMBL119070 | N-(3-Aminomethyl-phenyl)-2-[(S)-2-h...)
Show SMILES COc1ccc(cc1)[C@](C)(NC[C@H](O)c1ccc(O)c(NS(C)(=O)=O)c1)C(=O)Nc1cccc(CN)c1
Show InChI InChI=1S/C26H32N4O6S/c1-26(19-8-10-21(36-2)11-9-19,25(33)29-20-6-4-5-17(13-20)15-27)28-16-24(32)18-7-12-23(31)22(14-18)30-37(3,34)35/h4-14,24,28,30-32H,15-16,27H2,1-3H3,(H,29,33)/t24-,26-/m0/s1
Reactome pathway
115n/an/an/an/an/an/an/an/a
Bristol-Myers Squibb Pharmaceutical Research Institute
Curated by ChEMBL
Assay Description
Binding affinity towards human beta-3 adrenergic receptor expressed in CHO cells
Bioorg Med Chem Lett 14: 3525-9 (2004)
Article DOI: 10.1016/j.bmcl.2004.04.074
BindingDB Entry DOI: 10.7270/Q2MP52Q7
Beta-1 adrenergic receptor
(Homo sapiens (Human))
BDBM50148494
(CHEMBL119070 | N-(3-Aminomethyl-phenyl)-2-[(S)-2-h...)
Show SMILES COc1ccc(cc1)[C@](C)(NC[C@H](O)c1ccc(O)c(NS(C)(=O)=O)c1)C(=O)Nc1cccc(CN)c1
Show InChI InChI=1S/C26H32N4O6S/c1-26(19-8-10-21(36-2)11-9-19,25(33)29-20-6-4-5-17(13-20)15-27)28-16-24(32)18-7-12-23(31)22(14-18)30-37(3,34)35/h4-14,24,28,30-32H,15-16,27H2,1-3H3,(H,29,33)/t24-,26-/m0/s1
Reactome pathway
n/an/an/an/a 1.20E+4n/an/an/an/a
Bristol-Myers Squibb Pharmaceutical Research Institute
Curated by ChEMBL
Assay Description
Effective concentration required for inhibitory activity towards human beta-1 adrenergic receptor
Bioorg Med Chem Lett 14: 3525-9 (2004)
Article DOI: 10.1016/j.bmcl.2004.04.074
BindingDB Entry DOI: 10.7270/Q2MP52Q7