BDBM50148926 CHEMBL3769456
SMILES: CNc1ncc2cc(-c3ccc(cc3Cl)-c3cncc(C)n3)c(=O)n(C[C@H]3CC[C@H](N)CC3)c2n1
InChI Key: InChIKey=HWHNITBPQIFDQC-RUCARUNLSA-N
Data: 1 KI  1 IC50
Activity Spreadsheet -- Enzyme Inhibition Constant Data from BindingDB
Found 2 hits for monomerid = 50148926
Trg + Lig
Ki
nM
ΔG°
kcal/mole
IC50
nM
Kd
nM
EC50/IC50
nM
koff
s-1
kon
M-1s-1
pHTemp
°C
PAK 1/CDC42
(Homo sapiens (Human))
BDBM50148926
(CHEMBL3769456)
Show SMILES CNc1ncc2cc(-c3ccc(cc3Cl)-c3cncc(C)n3)c(=O)n(C[C@H]3CC[C@H](N)CC3)c2n1 |r,wU:29.31,wD:26.27,(-5.08,.92,;-4.02,1.54,;-2.68,.77,;-2.68,-.77,;-1.33,-1.54,;,-.77,;1.33,-1.54,;2.66,-.77,;4,-1.54,;3.99,-3.08,;5.33,-3.85,;6.66,-3.08,;6.66,-1.54,;5.33,-.77,;5.33,.46,;7.99,-3.86,;9.33,-3.09,;10.66,-3.86,;10.66,-5.4,;9.32,-6.17,;9.32,-7.4,;7.99,-5.4,;2.66,.77,;3.73,1.38,;1.33,1.54,;1.33,3.08,;2.67,3.85,;4,3.07,;5.34,3.84,;5.34,5.38,;6.41,5.99,;4.01,6.15,;2.68,5.39,;,.77,;-1.33,1.54,)|
Show InChI InChI=1S/C26H28ClN7O/c1-15-11-30-13-23(32-15)17-5-8-20(22(27)10-17)21-9-18-12-31-26(29-2)33-24(18)34(25(21)35)14-16-3-6-19(28)7-4-16/h5,8-13,16,19H,3-4,6-7,14,28H2,1-2H3,(H,29,31,33)/t16-,19-
7.40n/an/an/an/an/an/an/an/a
Genentech
Curated by ChEMBL
Assay Description
Inhibition of human recombinant PAK1 kinase domain using coumarin/fluorescein-labeled FRET peptide as substrate preincubated for 10 mins followed by ...
ACS Med Chem Lett 6: 1241-6 (2015)
BindingDB Entry DOI: 10.7270/Q2MP554V
PAK 1/CDC42
(Homo sapiens (Human))
BDBM50148926
(CHEMBL3769456)
Show SMILES CNc1ncc2cc(-c3ccc(cc3Cl)-c3cncc(C)n3)c(=O)n(C[C@H]3CC[C@H](N)CC3)c2n1 |r,wU:29.31,wD:26.27,(-5.08,.92,;-4.02,1.54,;-2.68,.77,;-2.68,-.77,;-1.33,-1.54,;,-.77,;1.33,-1.54,;2.66,-.77,;4,-1.54,;3.99,-3.08,;5.33,-3.85,;6.66,-3.08,;6.66,-1.54,;5.33,-.77,;5.33,.46,;7.99,-3.86,;9.33,-3.09,;10.66,-3.86,;10.66,-5.4,;9.32,-6.17,;9.32,-7.4,;7.99,-5.4,;2.66,.77,;3.73,1.38,;1.33,1.54,;1.33,3.08,;2.67,3.85,;4,3.07,;5.34,3.84,;5.34,5.38,;6.41,5.99,;4.01,6.15,;2.68,5.39,;,.77,;-1.33,1.54,)|
Show InChI InChI=1S/C26H28ClN7O/c1-15-11-30-13-23(32-15)17-5-8-20(22(27)10-17)21-9-18-12-31-26(29-2)33-24(18)34(25(21)35)14-16-3-6-19(28)7-4-16/h5,8-13,16,19H,3-4,6-7,14,28H2,1-2H3,(H,29,31,33)/t16-,19-
n/an/a 341n/an/an/an/an/an/a
Genentech
Curated by ChEMBL
Assay Description
Inhibition of PAK1 in human EBC1 cells assessed as reduction in levels of MEK phosphorylation at S298 residue after 2 hrs by HTRF assay
ACS Med Chem Lett 6: 1241-6 (2015)
BindingDB Entry DOI: 10.7270/Q2MP554V