null
SMILES: FC(F)(F)c1ccccc1C(=O)OCC1CCCN(CCCc2ccccc2)C1
InChI Key: InChIKey=XHLFIAOBGYMSRR-UHFFFAOYSA-N
Activity Spreadsheet -- Enzyme Inhibition Constant Data from BindingDB
Found 3 hits for monomerid = 50149043
Trg + Lig
Ki
nM
ΔG°
kcal/mole
IC50
nM
Kd
nM
EC50/IC50
nM
koff
s-1
kon
M-1s-1
pHTemp
°C
Neuronal acetylcholine receptor subunit alpha-3/beta-4
(Homo sapiens (Human))
BDBM50149043
(2-Trifluoromethyl-benzoic acid 1-(3-phenyl-propyl)...)
Show SMILES FC(F)(F)c1ccccc1C(=O)OCC1CCCN(CCCc2ccccc2)C1
Show InChI InChI=1S/C23H26F3NO2/c24-23(25,26)21-13-5-4-12-20(21)22(28)29-17-19-11-7-15-27(16-19)14-6-10-18-8-2-1-3-9-18/h1-5,8-9,12-13,19H,6-7,10-11,14-17H2
n/an/a 3.20E+3n/an/an/an/an/an/a
Ohio University
Curated by ChEMBL
Assay Description
Effect on alpha3-beta4 neuronal nicotinic acetylcholine receptor-stimulated adrenal catecholamine secretion
Bioorg Med Chem Lett 14: 3739-42 (2004)
Article DOI: 10.1016/j.bmcl.2004.05.001
BindingDB Entry DOI: 10.7270/Q28G8M80
Neuronal acetylcholine receptor subunit alpha-4/beta-2
(Homo sapiens (Human))
BDBM50149043
(2-Trifluoromethyl-benzoic acid 1-(3-phenyl-propyl)...)
Show SMILES FC(F)(F)c1ccccc1C(=O)OCC1CCCN(CCCc2ccccc2)C1
Show InChI InChI=1S/C23H26F3NO2/c24-23(25,26)21-13-5-4-12-20(21)22(28)29-17-19-11-7-15-27(16-19)14-6-10-18-8-2-1-3-9-18/h1-5,8-9,12-13,19H,6-7,10-11,14-17H2
NCI pathway
Reactome pathway
n/an/a 7.94E+3n/an/an/an/an/an/a
The Ohio State University
Curated by ChEMBL
Assay Description
Antagonist activity at human nAChR alpha4/beta2 receptor expressed in HEK ts201 cells assessed as calcium accumulation by fluorescence analysis
Bioorg Med Chem Lett 22: 1797-813 (2012)
Article DOI: 10.1016/j.bmcl.2011.11.051
BindingDB Entry DOI: 10.7270/Q22Z16S2
Neuronal acetylcholine receptor subunit alpha-4/beta-2
(Homo sapiens (Human))
BDBM50149043
(2-Trifluoromethyl-benzoic acid 1-(3-phenyl-propyl)...)
Show SMILES FC(F)(F)c1ccccc1C(=O)OCC1CCCN(CCCc2ccccc2)C1
Show InChI InChI=1S/C23H26F3NO2/c24-23(25,26)21-13-5-4-12-20(21)22(28)29-17-19-11-7-15-27(16-19)14-6-10-18-8-2-1-3-9-18/h1-5,8-9,12-13,19H,6-7,10-11,14-17H2
NCI pathway
Reactome pathway
n/an/a 8.00E+3n/an/an/an/an/an/a
The Ohio State University
Curated by ChEMBL
Assay Description
Antagonist activity at human nAChR alpha4/beta2 receptor expressed in HEK ts201 cells assessed as calcium accumulation by fluorescence analysis
Bioorg Med Chem Lett 22: 1797-813 (2012)
Article DOI: 10.1016/j.bmcl.2011.11.051
BindingDB Entry DOI: 10.7270/Q22Z16S2