BDBM50149106 8-Biphenyl-4-yl-5-(2-methoxy-ethyl)-3H-[1,2,4]triazolo[5,1-i]purine::CHEMBL125147
SMILES: COCCc1nc2nc[nH]c2c2nc(nn12)-c1ccc(cc1)-c1ccccc1
InChI Key: InChIKey=ZCKQZNBYPKNEJN-UHFFFAOYSA-N
Data: 4 IC50
Activity Spreadsheet -- Enzyme Inhibition Constant Data from BindingDB
Found 4 hits for monomerid = 50149106
Trg + Lig
Ki
nM
ΔG°
kcal/mole
IC50
nM
Kd
nM
EC50/IC50
nM
koff
s-1
kon
M-1s-1
pHTemp
°C
Adenosine receptor A2a
(Homo sapiens (Human))
BDBM50149106
(8-Biphenyl-4-yl-5-(2-methoxy-ethyl)-3H-[1,2,4]tria...)
Show SMILES COCCc1nc2nc[nH]c2c2nc(nn12)-c1ccc(cc1)-c1ccccc1
Show InChI InChI=1S/C21H18N6O/c1-28-12-11-17-24-20-18(22-13-23-20)21-25-19(26-27(17)21)16-9-7-15(8-10-16)14-5-3-2-4-6-14/h2-10,13H,11-12H2,1H3,(H,22,23)
NCI pathway
Reactome pathway
n/an/a>1.00E+4n/an/an/an/an/an/a
Otsuka Pharmaceutical Factory, Inc.
Curated by ChEMBL
Assay Description
Displacement of specific [3H]-CGS- 21680 binding at human adenosine A2A receptor expressed in HEK-293 cells
Bioorg Med Chem Lett 14: 3775-9 (2004)
Article DOI: 10.1016/j.bmcl.2004.04.099
BindingDB Entry DOI: 10.7270/Q21R6PZM
Adenosine receptor A3
(Homo sapiens (Human))
BDBM50149106
(8-Biphenyl-4-yl-5-(2-methoxy-ethyl)-3H-[1,2,4]tria...)
Show SMILES COCCc1nc2nc[nH]c2c2nc(nn12)-c1ccc(cc1)-c1ccccc1
Show InChI InChI=1S/C21H18N6O/c1-28-12-11-17-24-20-18(22-13-23-20)21-25-19(26-27(17)21)16-9-7-15(8-10-16)14-5-3-2-4-6-14/h2-10,13H,11-12H2,1H3,(H,22,23)
Reactome pathway
n/an/a 0.900n/an/an/an/an/an/a
Otsuka Pharmaceutical Factory, Inc.
Curated by ChEMBL
Assay Description
Displacement of specific [125I]-AB-MECA binding at human adenosine A3 receptor expressed in HEK-293 cells
Bioorg Med Chem Lett 14: 3775-9 (2004)
Article DOI: 10.1016/j.bmcl.2004.04.099
BindingDB Entry DOI: 10.7270/Q21R6PZM
Adenosine receptor A1
(Homo sapiens (Human))
BDBM50149106
(8-Biphenyl-4-yl-5-(2-methoxy-ethyl)-3H-[1,2,4]tria...)
Show SMILES COCCc1nc2nc[nH]c2c2nc(nn12)-c1ccc(cc1)-c1ccccc1
Show InChI InChI=1S/C21H18N6O/c1-28-12-11-17-24-20-18(22-13-23-20)21-25-19(26-27(17)21)16-9-7-15(8-10-16)14-5-3-2-4-6-14/h2-10,13H,11-12H2,1H3,(H,22,23)
Reactome pathway
n/an/a>1.00E+4n/an/an/an/an/an/a
Otsuka Pharmaceutical Factory, Inc.
Curated by ChEMBL
Assay Description
Displacement of specific [3H]-DPCPX binding at human adenosine A1 receptor expressed in CHO cells.
Bioorg Med Chem Lett 14: 3775-9 (2004)
Article DOI: 10.1016/j.bmcl.2004.04.099
BindingDB Entry DOI: 10.7270/Q21R6PZM
Adenosine receptor A2b
(Homo sapiens (Human))
BDBM50149106
(8-Biphenyl-4-yl-5-(2-methoxy-ethyl)-3H-[1,2,4]tria...)
Show SMILES COCCc1nc2nc[nH]c2c2nc(nn12)-c1ccc(cc1)-c1ccccc1
Show InChI InChI=1S/C21H18N6O/c1-28-12-11-17-24-20-18(22-13-23-20)21-25-19(26-27(17)21)16-9-7-15(8-10-16)14-5-3-2-4-6-14/h2-10,13H,11-12H2,1H3,(H,22,23)
NCI pathway
Reactome pathway
n/an/a>1.00E+4n/an/an/an/an/an/a
Otsuka Pharmaceutical Factory, Inc.
Curated by ChEMBL
Assay Description
Displacement of specific [3H]-DPCPX binding at human adenosine A2B receptor expressed in HEK-293 cells.
Bioorg Med Chem Lett 14: 3775-9 (2004)
Article DOI: 10.1016/j.bmcl.2004.04.099
BindingDB Entry DOI: 10.7270/Q21R6PZM