BDBM50149246 CHEMBL3769920
SMILES: COc1ncc(C)cc1CC[C@](O)(CC(O)=O)C(O)=O
InChI Key: InChIKey=FGYMJXFSHBLHLW-ZDUSSCGKSA-N
Data: 1 IC50
Activity Spreadsheet -- Enzyme Inhibition Constant Data from BindingDB
Found 1 hit for monomerid = 50149246
Trg + Lig
Ki
nM
ΔG°
kcal/mole
IC50
nM
Kd
nM
EC50/IC50
nM
koff
s-1
kon
M-1s-1
pHTemp
°C
Solute carrier family 13 member 5
(Homo sapiens (Human))
BDBM50149246
(CHEMBL3769920)
Show SMILES COc1ncc(C)cc1CC[C@](O)(CC(O)=O)C(O)=O |r|
Show InChI InChI=1S/C13H17NO6/c1-8-5-9(11(20-2)14-7-8)3-4-13(19,12(17)18)6-10(15)16/h5,7,19H,3-4,6H2,1-2H3,(H,15,16)(H,17,18)/t13-/m0/s1
n/an/a>1.80E+4n/an/an/an/an/an/a
Pfizer Inc.
Curated by ChEMBL
Assay Description
Inhibition of NaCT (unknown origin) expressed in HEK293 cells assessed as inhibition of [14C]citrate uptake by microbeta plate reader analysis
J Med Chem 59: 1165-75 (2016)
BindingDB Entry DOI: 10.7270/Q2ZW1NRC