BDBM50149292 CHEMBL3771155
SMILES: CCOc1ncccc1CC[C@](O)(CC(O)=O)C(O)=O
InChI Key: InChIKey=YXPFSQPGKGPKJQ-ZDUSSCGKSA-N
Data: 2 IC50
Activity Spreadsheet -- Enzyme Inhibition Constant Data from BindingDB
Found 2 hits for monomerid = 50149292
Trg + Lig
Ki
nM
ΔG°
kcal/mole
IC50
nM
Kd
nM
EC50/IC50
nM
koff
s-1
kon
M-1s-1
pHTemp
°C
Solute carrier family 13 member 5
(Homo sapiens (Human))
BDBM50149292
(CHEMBL3771155)
Show SMILES CCOc1ncccc1CC[C@](O)(CC(O)=O)C(O)=O |r|
Show InChI InChI=1S/C13H17NO6/c1-2-20-11-9(4-3-7-14-11)5-6-13(19,12(17)18)8-10(15)16/h3-4,7,19H,2,5-6,8H2,1H3,(H,15,16)(H,17,18)/t13-/m0/s1
n/an/a>3.00E+4n/an/an/an/an/an/a
Pfizer Inc.
Curated by ChEMBL
Assay Description
Inhibition of NaCT in human hepatocytes assessed as [14C]-citrate uptake after 30 mins by scintillation counting method
J Med Chem 59: 1165-75 (2016)
BindingDB Entry DOI: 10.7270/Q2ZW1NRC
Solute carrier family 13 member 5
(Homo sapiens (Human))
BDBM50149292
(CHEMBL3771155)
Show SMILES CCOc1ncccc1CC[C@](O)(CC(O)=O)C(O)=O |r|
Show InChI InChI=1S/C13H17NO6/c1-2-20-11-9(4-3-7-14-11)5-6-13(19,12(17)18)8-10(15)16/h3-4,7,19H,2,5-6,8H2,1H3,(H,15,16)(H,17,18)/t13-/m0/s1
n/an/a>2.50E+4n/an/an/an/an/an/a
Pfizer Inc.
Curated by ChEMBL
Assay Description
Inhibition of NaCT (unknown origin) expressed in HEK293 cells assessed as inhibition of [14C]citrate uptake by microbeta plate reader analysis
J Med Chem 59: 1165-75 (2016)
BindingDB Entry DOI: 10.7270/Q2ZW1NRC