BDBM50149604 (E)-3-Phenyl-acrylic acid 3-phenoxy-benzyl ester::CHEMBL183010
SMILES: O=C(OCc1cccc(Oc2ccccc2)c1)\C=C\c1ccccc1
InChI Key: InChIKey=AFTBYVPUGZGHAX-CCEZHUSRSA-N
Data: 1 IC50
Activity Spreadsheet -- Enzyme Inhibition Constant Data from BindingDB
Found 1 hit for monomerid = 50149604
Trg + Lig
Ki
nM
ΔG°
kcal/mole
IC50
nM
Kd
nM
EC50/IC50
nM
koff
s-1
kon
M-1s-1
pHTemp
°C
17-beta-hydroxysteroid-dehydrogenase
(Curvularia lunata)
BDBM50149604
((E)-3-Phenyl-acrylic acid 3-phenoxy-benzyl ester |...)
Show SMILES O=C(OCc1cccc(Oc2ccccc2)c1)\C=C\c1ccccc1
Show InChI InChI=1S/C22H18O3/c23-22(15-14-18-8-3-1-4-9-18)24-17-19-10-7-13-21(16-19)25-20-11-5-2-6-12-20/h1-16H,17H2/b15-14+
n/an/a 1.30E+5n/an/an/an/an/an/a
University of Ljubljana
Curated by ChEMBL
Assay Description
Inhibitory activity against 17 beta-hydroxysteroid dehydrogenase catalysed oxidation reaction
Bioorg Med Chem Lett 14: 3933-6 (2004)
Article DOI: 10.1016/j.bmcl.2004.05.069
BindingDB Entry DOI: 10.7270/Q2V40TN6