BDBM50149706 CHEMBL3769652
SMILES: CN(C)C(=O)N1CCC(CC1)n1ncc2c(cc(Br)nc12)C(=O)NCc1c(C)cc(C)[nH]c1=O
InChI Key: InChIKey=VVQXKAYHSGXYJQ-UHFFFAOYSA-N
Data: 1 IC50
Activity Spreadsheet -- Enzyme Inhibition Constant Data from BindingDB
Found 1 hit for monomerid = 50149706
Trg + Lig
Ki
nM
ΔG°
kcal/mole
IC50
nM
Kd
nM
EC50/IC50
nM
koff
s-1
kon
M-1s-1
pHTemp
°C
Histone-lysine N-methyltransferase EZH2
(Homo sapiens (Human))
BDBM50149706
(CHEMBL3769652)
Show SMILES CN(C)C(=O)N1CCC(CC1)n1ncc2c(cc(Br)nc12)C(=O)NCc1c(C)cc(C)[nH]c1=O
Show InChI InChI=1S/C23H28BrN7O3/c1-13-9-14(2)27-22(33)17(13)11-25-21(32)16-10-19(24)28-20-18(16)12-26-31(20)15-5-7-30(8-6-15)23(34)29(3)4/h9-10,12,15H,5-8,11H2,1-4H3,(H,25,32)(H,27,33)
n/an/a 50n/an/an/an/an/an/a
Epizyme
Curated by ChEMBL
Assay Description
Inhibition of methyltransferase activity of human EZH2 using chicken oligonucleotide as substrate by pull down assay
J Med Chem 59: 1556-64 (2016)
BindingDB Entry DOI: 10.7270/Q2B56MM7