BDBM50149879 CHEMBL3770626
SMILES: Cc1cc(C)c(CNC(=O)c2cc(Br)nc3n(ncc23)C2CCOCC2)c(=O)[nH]1
InChI Key: InChIKey=JOSDKXHHBIVBSD-UHFFFAOYSA-N
Data: 1 IC50
Activity Spreadsheet -- Enzyme Inhibition Constant Data from BindingDB
Found 1 hit for monomerid = 50149879
Trg + Lig
Ki
nM
ΔG°
kcal/mole
IC50
nM
Kd
nM
EC50/IC50
nM
koff
s-1
kon
M-1s-1
pHTemp
°C
Histone-lysine N-methyltransferase EZH2
(Homo sapiens (Human))
BDBM50149879
(CHEMBL3770626)
Show SMILES Cc1cc(C)c(CNC(=O)c2cc(Br)nc3n(ncc23)C2CCOCC2)c(=O)[nH]1
Show InChI InChI=1S/C20H22BrN5O3/c1-11-7-12(2)24-20(28)15(11)9-22-19(27)14-8-17(21)25-18-16(14)10-23-26(18)13-3-5-29-6-4-13/h7-8,10,13H,3-6,9H2,1-2H3,(H,22,27)(H,24,28)
n/an/a 700n/an/an/an/an/an/a
Epizyme
Curated by ChEMBL
Assay Description
Inhibition of methyltransferase activity of human EZH2 using chicken oligonucleotide as substrate by pull down assay
J Med Chem 59: 1556-64 (2016)
BindingDB Entry DOI: 10.7270/Q2B56MM7