BDBM50149889 CHEMBL3769571
SMILES: CCN(C1CCOCC1)c1cc(Cl)cc(C(=O)NCc2c(C)cc(C)[nH]c2=O)c1C
InChI Key: InChIKey=WTLMWQKFNDPIPC-UHFFFAOYSA-N
Data: 1 IC50  1 EC50
Activity Spreadsheet -- Enzyme Inhibition Constant Data from BindingDB
Found 2 hits for monomerid = 50149889
Trg + Lig
Ki
nM
ΔG°
kcal/mole
IC50
nM
Kd
nM
EC50/IC50
nM
koff
s-1
kon
M-1s-1
pHTemp
°C
Histone-lysine N-methyltransferase EZH2
(Homo sapiens (Human))
BDBM50149889
(CHEMBL3769571)
Show SMILES CCN(C1CCOCC1)c1cc(Cl)cc(C(=O)NCc2c(C)cc(C)[nH]c2=O)c1C
Show InChI InChI=1S/C23H30ClN3O3/c1-5-27(18-6-8-30-9-7-18)21-12-17(24)11-19(16(21)4)22(28)25-13-20-14(2)10-15(3)26-23(20)29/h10-12,18H,5-9,13H2,1-4H3,(H,25,28)(H,26,29)
n/an/an/an/a 300n/an/an/an/a
Epizyme
Curated by ChEMBL
Assay Description
Inhibition of methyltransferase activity of EZH2 in human G401 cells assessed as H3K27 trimethylation after 4 hrs by ELISA
J Med Chem 59: 1556-64 (2016)
BindingDB Entry DOI: 10.7270/Q2B56MM7
Histone-lysine N-methyltransferase EZH2
(Homo sapiens (Human))
BDBM50149889
(CHEMBL3769571)
Show SMILES CCN(C1CCOCC1)c1cc(Cl)cc(C(=O)NCc2c(C)cc(C)[nH]c2=O)c1C
Show InChI InChI=1S/C23H30ClN3O3/c1-5-27(18-6-8-30-9-7-18)21-12-17(24)11-19(16(21)4)22(28)25-13-20-14(2)10-15(3)26-23(20)29/h10-12,18H,5-9,13H2,1-4H3,(H,25,28)(H,26,29)
n/an/a 10n/an/an/an/an/an/a
Epizyme
Curated by ChEMBL
Assay Description
Inhibition of methyltransferase activity of human EZH2 using chicken oligonucleotide as substrate by pull down assay
J Med Chem 59: 1556-64 (2016)
BindingDB Entry DOI: 10.7270/Q2B56MM7