BDBM50149926 CHEMBL3770723
SMILES: Oc1cccc(Oc2nc3cnccc3c(=O)[nH]2)c1
InChI Key: InChIKey=BCWXPYVDMCLXJB-UHFFFAOYSA-N
Data: 2 IC50
Activity Spreadsheet -- Enzyme Inhibition Constant Data from BindingDB
Found 2 hits for monomerid = 50149926
Trg + Lig
Ki
nM
ΔG°
kcal/mole
IC50
nM
Kd
nM
EC50/IC50
nM
koff
s-1
kon
M-1s-1
pHTemp
°C
Lysine-specific demethylase 4C
(Homo sapiens (Human))
BDBM50149926
(CHEMBL3770723)
Show SMILES Oc1cccc(Oc2nc3cnccc3c(=O)[nH]2)c1
Show InChI InChI=1S/C21H19ClN4O4S/c22-16-9-10-19(25-13-16)26-20(27)11-12-24-21(28)15-7-5-14(6-8-15)17-3-1-2-4-18(17)31(23,29)30/h1-10,13H,11-12H2,(H,24,28)(H2,23,29,30)(H,25,26,27)
n/an/a 1.00E+4n/an/an/an/an/an/a
GlaxoSmithKline R&D
Curated by ChEMBL
Assay Description
Inhibition of N-terminal his-tagged full-length human KDM4C transfected in U2OS cells assessed as inhibition of H3K9Me3 demethylation for 24 hrs
J Med Chem 59: 1370-87 (2016)
BindingDB Entry DOI: 10.7270/Q26D5VV2
Lysine-specific demethylase 4C
(Homo sapiens (Human))
BDBM50149926
(CHEMBL3770723)
Show SMILES Oc1cccc(Oc2nc3cnccc3c(=O)[nH]2)c1
Show InChI InChI=1S/C21H19ClN4O4S/c22-16-9-10-19(25-13-16)26-20(27)11-12-24-21(28)15-7-5-14(6-8-15)17-3-1-2-4-18(17)31(23,29)30/h1-10,13H,11-12H2,(H,24,28)(H2,23,29,30)(H,25,26,27)
n/an/a 200n/an/an/an/an/an/a
GlaxoSmithKline R&D
Curated by ChEMBL
Assay Description
Inhibition of N-terminal his-tagged human KDM4C expressed in Escherichia coli BL21(DE3) using trimethylated peptide substrate by RFMS assay
J Med Chem 59: 1370-87 (2016)
BindingDB Entry DOI: 10.7270/Q26D5VV2