BDBM50149930 CHEMBL3770319
SMILES: O=c1[nH]c(OC2CCCCC2)nc2cnccc12
InChI Key: InChIKey=BFVCDQDSARMQIK-UHFFFAOYSA-N
Data: 2 IC50
Activity Spreadsheet -- Enzyme Inhibition Constant Data from BindingDB
Found 2 hits for monomerid = 50149930
Trg + Lig
Ki
nM
ΔG°
kcal/mole
IC50
nM
Kd
nM
EC50/IC50
nM
koff
s-1
kon
M-1s-1
pHTemp
°C
Lysine-specific demethylase 4C
(Homo sapiens (Human))
BDBM50149930
(CHEMBL3770319)
Show SMILES O=c1[nH]c(OC2CCCCC2)nc2cnccc12
Show InChI InChI=1S/C28H25BrN6O5S/c29-19-12-15-25(31-17-19)35-26(36)16-23(34-28(38)33-20-6-2-1-3-7-20)27(37)32-21-13-10-18(11-14-21)22-8-4-5-9-24(22)41(30,39)40/h1-15,17,23H,16H2,(H,32,37)(H2,30,39,40)(H,31,35,36)(H2,33,34,38)
n/an/a 2.51E+4n/an/an/an/an/an/a
GlaxoSmithKline R&D
Curated by ChEMBL
Assay Description
Inhibition of N-terminal his-tagged full-length human KDM4C transfected in U2OS cells assessed as inhibition of H3K9Me3 demethylation for 24 hrs
J Med Chem 59: 1370-87 (2016)
BindingDB Entry DOI: 10.7270/Q26D5VV2
Lysine-specific demethylase 4C
(Homo sapiens (Human))
BDBM50149930
(CHEMBL3770319)
Show SMILES O=c1[nH]c(OC2CCCCC2)nc2cnccc12
Show InChI InChI=1S/C28H25BrN6O5S/c29-19-12-15-25(31-17-19)35-26(36)16-23(34-28(38)33-20-6-2-1-3-7-20)27(37)32-21-13-10-18(11-14-21)22-8-4-5-9-24(22)41(30,39)40/h1-15,17,23H,16H2,(H,32,37)(H2,30,39,40)(H,31,35,36)(H2,33,34,38)
n/an/a 3.16E+3n/an/an/an/an/an/a
GlaxoSmithKline R&D
Curated by ChEMBL
Assay Description
Inhibition of N-terminal his-tagged human KDM4C expressed in Escherichia coli BL21(DE3) using trimethylated peptide substrate by RFMS assay
J Med Chem 59: 1370-87 (2016)
BindingDB Entry DOI: 10.7270/Q26D5VV2