BDBM50150043 CHEMBL3769727
SMILES: CC(=O)Oc1ccc(Cn2c(C)nc3c(c(Cl)c(Cl)cc23)[N+]([O-])=O)cc1
InChI Key: InChIKey=HXBWTZQQMLTAEX-UHFFFAOYSA-N
Data: 1 IC50
Activity Spreadsheet -- Enzyme Inhibition Constant Data from BindingDB
Found 1 hit for monomerid = 50150043
Trg + Lig
Ki
nM
ΔG°
kcal/mole
IC50
nM
Kd
nM
EC50/IC50
nM
koff
s-1
kon
M-1s-1
pHTemp
°C
dCTP pyrophosphatase 1
(Homo sapiens (Human))
BDBM50150043
(CHEMBL3769727)
Show SMILES CC(=O)Oc1ccc(Cn2c(C)nc3c(c(Cl)c(Cl)cc23)[N+]([O-])=O)cc1
Show InChI InChI=1S/C17H13Cl2N3O4/c1-9-20-16-14(7-13(18)15(19)17(16)22(24)25)21(9)8-11-3-5-12(6-4-11)26-10(2)23/h3-7H,8H2,1-2H3
n/an/a 34n/an/an/an/an/an/a
Karolinska Institutet
Curated by ChEMBL
Assay Description
Inhibition of human recombinant full length dCTPase expressed in Escherichia coli BL21(DE3)pLysS using dCTP as substrate after 1 hr by HTS-adapted Ma...
J Med Chem 59: 1140-8 (2016)
BindingDB Entry DOI: 10.7270/Q2959KDZ