BDBM50150051 CHEMBL3770446
SMILES: Cc1nc2c(c(Cl)c(Cl)cc2n1Cc1cccc(c1)B(O)O)[N+]([O-])=O
InChI Key: InChIKey=PUZPNBFPGAMIJO-UHFFFAOYSA-N
Data: 1 IC50
Activity Spreadsheet -- Enzyme Inhibition Constant Data from BindingDB
Found 1 hit for monomerid = 50150051
Trg + Lig
Ki
nM
ΔG°
kcal/mole
IC50
nM
Kd
nM
EC50/IC50
nM
koff
s-1
kon
M-1s-1
pHTemp
°C
dCTP pyrophosphatase 1 (DCTPP1)
(Homo sapiens (Human))
BDBM50150051
(CHEMBL3770446)
Show SMILES Cc1nc2c(c(Cl)c(Cl)cc2n1Cc1cccc(c1)B(O)O)[N+]([O-])=O
Show InChI InChI=1S/C15H12BCl2N3O4/c1-8-19-14-12(6-11(17)13(18)15(14)21(24)25)20(8)7-9-3-2-4-10(5-9)16(22)23/h2-6,22-23H,7H2,1H3
n/an/a 46n/an/an/an/an/an/a
Karolinska Institutet
Curated by ChEMBL
Assay Description
Inhibition of human recombinant full length dCTPase expressed in Escherichia coli BL21(DE3)pLysS using dCTP as substrate after 1 hr by HTS-adapted Ma...
J Med Chem 59: 1140-8 (2016)
BindingDB Entry DOI: 10.7270/Q2959KDZ