null
SMILES: C(N1CCC(=CC1)c1ccccn1)c1nc2ccccc2[nH]1
InChI Key: InChIKey=PSXITITZQSEYMQ-UHFFFAOYSA-N
Activity Spreadsheet -- Enzyme Inhibition Constant Data from BindingDB
Found 1 hit for monomerid = 50150137
Trg + Lig
Ki
nM
ΔG°
kcal/mole
IC50
nM
Kd
nM
EC50/IC50
nM
koff
s-1
kon
M-1s-1
pHTemp
°C
D(4) dopamine receptor
(Homo sapiens (Human))
BDBM50150137
(1'-(1H-Benzoimidazol-2-ylmethyl)-1',2',3',6'-tetra...)
Show SMILES C(N1CCC(=CC1)c1ccccn1)c1nc2ccccc2[nH]1 |c:4|
Show InChI InChI=1S/C18H18N4/c1-2-7-17-16(6-1)20-18(21-17)13-22-11-8-14(9-12-22)15-5-3-4-10-19-15/h1-8,10H,9,11-13H2,(H,20,21)
Reactome pathway
n/an/an/an/a 11n/an/an/an/a
Abbott Laboratories
Curated by ChEMBL
Assay Description
In vitro effective concentration tested on HEK293 cells co-transfected with human D4.4 receptor using FLIPR assay
J Med Chem 47: 3853-64 (2004)
Article DOI: 10.1021/jm030505a
BindingDB Entry DOI: 10.7270/Q24B3225