BDBM50150174 CHEMBL124522::Carbamic acid (4E,6Z,10E)-(8S,9S,12S,13R,14S,16R)-13-hydroxy-8,14-dimethoxy-19-(4-methoxy-benzoylamino)-4,10,12,16-tetramethyl-3,20,22-trioxo-2-aza-bicyclo[16.3.1]docosa-1(21),4,6,10,18-pentaen-9-yl ester
SMILES: CO[C@H]1CC(C)=Cc2c(O)c(NC(=O)C(C)=CC=C[C@H](OC)[C@@H](OC(N)=O)\C(C)=C\[C@H](C)[C@H]1O)cc(O)c2NC(=O)c1ccc(OC)cc1
InChI Key: InChIKey=KOSZBGRKMIGGON-LQKAHAJISA-N
Data: 3 IC50
Activity Spreadsheet -- Enzyme Inhibition Constant Data from BindingDB
Found 3 hits for monomerid = 50150174
Trg + Lig
Ki
nM
ΔG°
kcal/mole
IC50
nM
Kd
nM
EC50/IC50
nM
koff
s-1
kon
M-1s-1
pHTemp
°C
Heat Shock Protein 90 (Hsp90)
(Homo sapiens (Human))
BDBM50150174
(CHEMBL124522 | Carbamic acid (4E,6Z,10E)-(8S,9S,12...)
Show SMILES CO[C@H]1CC(C)=Cc2c(O)c(NC(=O)C(C)=CC=C[C@H](OC)[C@@H](OC(N)=O)\C(C)=C\[C@H](C)[C@H]1O)cc(O)c2NC(=O)c1ccc(OC)cc1 |w:6.6,16.16,t:28|
Show InChI InChI=1S/C36H45N3O10/c1-19-15-25-30(39-35(44)23-11-13-24(46-5)14-12-23)27(40)18-26(32(25)42)38-34(43)20(2)9-8-10-28(47-6)33(49-36(37)45)22(4)17-21(3)31(41)29(16-19)48-7/h8-15,17-18,21,28-29,31,33,40-42H,16H2,1-7H3,(H2,37,45)(H,38,43)(H,39,44)/b10-8?,19-15?,20-9?,22-17+/t21-,28-,29-,31+,33-/m0/s1
Reactome pathway
n/an/a 400n/an/an/an/an/an/a
Conforma Therapeutics Corporation
Curated by ChEMBL
Assay Description
Inhibition of human epidermal growth factor 2 (Her-2) degredation in MCF-7 cells
J Med Chem 47: 3865-73 (2004)
Article DOI: 10.1021/jm0306125
BindingDB Entry DOI: 10.7270/Q2NC60N3
Heat Shock Protein 90 (Hsp90)
(Homo sapiens (Human))
BDBM50150174
(CHEMBL124522 | Carbamic acid (4E,6Z,10E)-(8S,9S,12...)
Show SMILES CO[C@H]1CC(C)=Cc2c(O)c(NC(=O)C(C)=CC=C[C@H](OC)[C@@H](OC(N)=O)\C(C)=C\[C@H](C)[C@H]1O)cc(O)c2NC(=O)c1ccc(OC)cc1 |w:6.6,16.16,t:28|
Show InChI InChI=1S/C36H45N3O10/c1-19-15-25-30(39-35(44)23-11-13-24(46-5)14-12-23)27(40)18-26(32(25)42)38-34(43)20(2)9-8-10-28(47-6)33(49-36(37)45)22(4)17-21(3)31(41)29(16-19)48-7/h8-15,17-18,21,28-29,31,33,40-42H,16H2,1-7H3,(H2,37,45)(H,38,43)(H,39,44)/b10-8?,19-15?,20-9?,22-17+/t21-,28-,29-,31+,33-/m0/s1
Reactome pathway
n/an/a 5.00E+3n/an/an/an/an/an/a
Conforma Therapeutics Corporation
Curated by ChEMBL
Assay Description
Concentration required to inhibit biotin-GM binding to recombinant heat shock protein 90(rHsp90)
J Med Chem 47: 3865-73 (2004)
Article DOI: 10.1021/jm0306125
BindingDB Entry DOI: 10.7270/Q2NC60N3
Heat Shock Protein 90 (Hsp90)
(Homo sapiens (Human))
BDBM50150174
(CHEMBL124522 | Carbamic acid (4E,6Z,10E)-(8S,9S,12...)
Show SMILES CO[C@H]1CC(C)=Cc2c(O)c(NC(=O)C(C)=CC=C[C@H](OC)[C@@H](OC(N)=O)\C(C)=C\[C@H](C)[C@H]1O)cc(O)c2NC(=O)c1ccc(OC)cc1 |w:6.6,16.16,t:28|
Show InChI InChI=1S/C36H45N3O10/c1-19-15-25-30(39-35(44)23-11-13-24(46-5)14-12-23)27(40)18-26(32(25)42)38-34(43)20(2)9-8-10-28(47-6)33(49-36(37)45)22(4)17-21(3)31(41)29(16-19)48-7/h8-15,17-18,21,28-29,31,33,40-42H,16H2,1-7H3,(H2,37,45)(H,38,43)(H,39,44)/b10-8?,19-15?,20-9?,22-17+/t21-,28-,29-,31+,33-/m0/s1
Reactome pathway
n/an/a 4.00E+3n/an/an/an/an/an/a
Conforma Therapeutics Corporation
Curated by ChEMBL
Assay Description
Concentration required to inhbit Bis-ANS activity by recombinant heat shock protein 90 (rHSP90) conformational assay
J Med Chem 47: 3865-73 (2004)
Article DOI: 10.1021/jm0306125
BindingDB Entry DOI: 10.7270/Q2NC60N3