BDBM50150618 CHEMBL182871::Hexanedioic acid {4-[3,6-bis-(3-pyrrolidin-1-yl-propionylamino)-acridin-9-ylamino]-phenyl}-amide (6-diethylamino-hexyl)-amide::N1-(4-(3,6-bis(3-(pyrrolidin-1-yl)propanamido)acridin-9-ylamino)phenyl)-N6-(6-(diethylamino)hexyl)adipamide
SMILES: CCN(CC)CCCCCCNC(=O)CCCCC(=O)Nc1ccc(Nc2c3ccc(NC(=O)CCN4CCCC4)cc3nc3cc(NC(=O)CCN4CCCC4)ccc23)cc1
InChI Key: InChIKey=LZZAQFNUKBCTHI-UHFFFAOYSA-N
Data: 1 IC50  1 EC50
Activity Spreadsheet -- Enzyme Inhibition Constant Data from BindingDB
Found 2 hits for monomerid = 50150618
Trg + Lig
Ki
nM
ΔG°
kcal/mole
IC50
nM
Kd
nM
EC50/IC50
nM
koff
s-1
kon
M-1s-1
pHTemp
°C
Telomerase reverse transcriptase
(Homo sapiens (Human))
BDBM50150618
(CHEMBL182871 | Hexanedioic acid {4-[3,6-bis-(3-pyr...)
Show SMILES CCN(CC)CCCCCCNC(=O)CCCCC(=O)Nc1ccc(Nc2c3ccc(NC(=O)CCN4CCCC4)cc3nc3cc(NC(=O)CCN4CCCC4)ccc23)cc1
Show InChI InChI=1S/C49H69N9O4/c1-3-56(4-2)28-10-6-5-9-27-50-45(59)15-7-8-16-46(60)51-37-17-19-38(20-18-37)54-49-41-23-21-39(52-47(61)25-33-57-29-11-12-30-57)35-43(41)55-44-36-40(22-24-42(44)49)53-48(62)26-34-58-31-13-14-32-58/h17-24,35-36H,3-16,25-34H2,1-2H3,(H,50,59)(H,51,60)(H,52,61)(H,53,62)(H,54,55)
NCI pathway
Reactome pathway
n/an/a 80n/an/an/an/an/an/a
Central University of Las Villas
Curated by ChEMBL
Assay Description
Inhibition of telomerase in human A2780 cells by TRAP assay
Eur J Med Chem 44: 4826-40 (2009)
Article DOI: 10.1016/j.ejmech.2009.07.029
BindingDB Entry DOI: 10.7270/Q20R9PHM
Telomerase reverse transcriptase
(Homo sapiens (Human))
BDBM50150618
(CHEMBL182871 | Hexanedioic acid {4-[3,6-bis-(3-pyr...)
Show SMILES CCN(CC)CCCCCCNC(=O)CCCCC(=O)Nc1ccc(Nc2c3ccc(NC(=O)CCN4CCCC4)cc3nc3cc(NC(=O)CCN4CCCC4)ccc23)cc1
Show InChI InChI=1S/C49H69N9O4/c1-3-56(4-2)28-10-6-5-9-27-50-45(59)15-7-8-16-46(60)51-37-17-19-38(20-18-37)54-49-41-23-21-39(52-47(61)25-33-57-29-11-12-30-57)35-43(41)55-44-36-40(22-24-42(44)49)53-48(62)26-34-58-31-13-14-32-58/h17-24,35-36H,3-16,25-34H2,1-2H3,(H,50,59)(H,51,60)(H,52,61)(H,53,62)(H,54,55)
NCI pathway
Reactome pathway
n/an/an/an/a 80n/an/an/an/a
University of London School of Pharmacy
Curated by ChEMBL
Assay Description
Effective concentration against telomerase by TRAP
Bioorg Med Chem Lett 14: 4347-51 (2004)
Article DOI: 10.1016/j.bmcl.2004.05.090
BindingDB Entry DOI: 10.7270/Q2KD1XDZ