BDBM50150891 (Z)-8-[(R)-4-Hydroxy-2-((1R,2S,4S)-3-hydroxy-4-phenoxy-but-1-enyl)-tetrahydro-furan-3-yl]-oct-6-enoic acid::CHEMBL273444
SMILES: O[C@H](COc1ccccc1)\C=C\[C@H]1OC[C@H](O)[C@@H]1C\C=C/CCCCC(O)=O
InChI Key: InChIKey=OKNROEDYSYFECH-NUPPDMPBSA-N
Data: 1 KI  1 EC50
Activity Spreadsheet -- Enzyme Inhibition Constant Data from BindingDB
Found 2 hits for monomerid = 50150891
Trg + Lig
Ki
nM
ΔG°
kcal/mole
IC50
nM
Kd
nM
EC50/IC50
nM
koff
s-1
kon
M-1s-1
pHTemp
°C
PTGFR
(BOVINE)
BDBM50150891
((Z)-8-[(R)-4-Hydroxy-2-((1R,2S,4S)-3-hydroxy-4-phe...)
Show SMILES O[C@H](COc1ccccc1)\C=C\[C@H]1OC[C@H](O)[C@@H]1C\C=C/CCCCC(O)=O
Show InChI InChI=1S/C22H30O6/c23-17(15-27-18-9-5-4-6-10-18)13-14-21-19(20(24)16-28-21)11-7-2-1-3-8-12-22(25)26/h2,4-7,9-10,13-14,17,19-21,23-24H,1,3,8,11-12,15-16H2,(H,25,26)/b7-2-,14-13+/t17-,19-,20-,21+/m0/s1
Reactome pathway
2.80E+3n/an/an/an/an/an/an/an/a
Alcon Research, Ltd
Curated by ChEMBL
Assay Description
Binding affinity for Prostanoid FP receptor of bovine corpus luteum
Bioorg Med Chem Lett 14: 4525-8 (2004)
Article DOI: 10.1016/j.bmcl.2004.06.037
BindingDB Entry DOI: 10.7270/Q2513ZZS
Prostaglandin F2-alpha receptor
(Homo sapiens (Human))
BDBM50150891
((Z)-8-[(R)-4-Hydroxy-2-((1R,2S,4S)-3-hydroxy-4-phe...)
Show SMILES O[C@H](COc1ccccc1)\C=C\[C@H]1OC[C@H](O)[C@@H]1C\C=C/CCCCC(O)=O
Show InChI InChI=1S/C22H30O6/c23-17(15-27-18-9-5-4-6-10-18)13-14-21-19(20(24)16-28-21)11-7-2-1-3-8-12-22(25)26/h2,4-7,9-10,13-14,17,19-21,23-24H,1,3,8,11-12,15-16H2,(H,25,26)/b7-2-,14-13+/t17-,19-,20-,21+/m0/s1
n/an/an/an/a 573n/an/an/an/a
Alcon Research, Ltd
Curated by ChEMBL
Assay Description
Efficacy for stimulation of prostanoid FP receptor-linked phosphoinositide turnover in Swiss 3T3 mouse fibroblast cells
Bioorg Med Chem Lett 14: 4525-8 (2004)
Article DOI: 10.1016/j.bmcl.2004.06.037
BindingDB Entry DOI: 10.7270/Q2513ZZS