BDBM50151134 2-Adamantan-1-yl-4-oxo-4H-chromene-6-carbaldehyde::CHEMBL189863
SMILES: O=Cc1ccc2oc(cc(=O)c2c1)C12CC3CC(CC(C3)C1)C2
InChI Key: InChIKey=FEOAVQLLDWFGLN-UHFFFAOYSA-N
Data: 1 KI  3 IC50
Activity Spreadsheet -- Enzyme Inhibition Constant Data from BindingDB
Found 4 hits for monomerid = 50151134
Trg + Lig
Ki
nM
ΔG°
kcal/mole
IC50
nM
Kd
nM
EC50/IC50
nM
koff
s-1
kon
M-1s-1
pHTemp
°C
Steryl-sulfatase
(Homo sapiens (Human))
BDBM50151134
(2-Adamantan-1-yl-4-oxo-4H-chromene-6-carbaldehyde ...)
Show SMILES O=Cc1ccc2oc(cc(=O)c2c1)C12CC3CC(CC(C3)C1)C2 |TLB:16:17:21:14.15.20,THB:16:15:21:22.17.18,18:17:14:21.19.20,18:19:14:22.17.16|
Show InChI InChI=1S/C20H20O3/c21-11-12-1-2-18-16(6-12)17(22)7-19(23-18)20-8-13-3-14(9-20)5-15(4-13)10-20/h1-2,6-7,11,13-15H,3-5,8-10H2
>2.00E+4n/an/an/an/an/an/an/an/a
Novartis Institute for Biomedical Research Vienna
Curated by ChEMBL
Assay Description
Inhibitory activity against human steroid sulfatase
J Med Chem 47: 4268-76 (2004)
Article DOI: 10.1021/jm0407916
BindingDB Entry DOI: 10.7270/Q2XW4KK4
Steryl-sulfatase
(Homo sapiens (Human))
BDBM50151134
(2-Adamantan-1-yl-4-oxo-4H-chromene-6-carbaldehyde ...)
Show SMILES O=Cc1ccc2oc(cc(=O)c2c1)C12CC3CC(CC(C3)C1)C2 |TLB:16:17:21:14.15.20,THB:16:15:21:22.17.18,18:17:14:21.19.20,18:19:14:22.17.16|
Show InChI InChI=1S/C20H20O3/c21-11-12-1-2-18-16(6-12)17(22)7-19(23-18)20-8-13-3-14(9-20)5-15(4-13)10-20/h1-2,6-7,11,13-15H,3-5,8-10H2
n/an/a>3.00E+4n/an/an/an/an/an/a
Novartis Institute for Biomedical Research Vienna
Curated by ChEMBL
Assay Description
Inhibitory activity against human steroid sulfatase over-expressed in CHO cells
J Med Chem 47: 4268-76 (2004)
Article DOI: 10.1021/jm0407916
BindingDB Entry DOI: 10.7270/Q2XW4KK4
Steryl-sulfatase
(Homo sapiens (Human))
BDBM50151134
(2-Adamantan-1-yl-4-oxo-4H-chromene-6-carbaldehyde ...)
Show SMILES O=Cc1ccc2oc(cc(=O)c2c1)C12CC3CC(CC(C3)C1)C2 |TLB:16:17:21:14.15.20,THB:16:15:21:22.17.18,18:17:14:21.19.20,18:19:14:22.17.16|
Show InChI InChI=1S/C20H20O3/c21-11-12-1-2-18-16(6-12)17(22)7-19(23-18)20-8-13-3-14(9-20)5-15(4-13)10-20/h1-2,6-7,11,13-15H,3-5,8-10H2
n/an/a>530n/an/an/an/an/an/a
Punjabi University
Curated by ChEMBL
Assay Description
Inhibition of recombinant human estrone sulfatase using 4-methylumbelliferyl sulfate as substrate by colorimetric assay
Eur J Med Chem 114: 170-90 (2016)
BindingDB Entry DOI: 10.7270/Q26Q2048
Steryl-sulfatase
(Homo sapiens (Human))
BDBM50151134
(2-Adamantan-1-yl-4-oxo-4H-chromene-6-carbaldehyde ...)
Show SMILES O=Cc1ccc2oc(cc(=O)c2c1)C12CC3CC(CC(C3)C1)C2 |TLB:16:17:21:14.15.20,THB:16:15:21:22.17.18,18:17:14:21.19.20,18:19:14:22.17.16|
Show InChI InChI=1S/C20H20O3/c21-11-12-1-2-18-16(6-12)17(22)7-19(23-18)20-8-13-3-14(9-20)5-15(4-13)10-20/h1-2,6-7,11,13-15H,3-5,8-10H2
n/an/a>180n/an/an/an/an/an/a
Punjabi University
Curated by ChEMBL
Assay Description
Inhibition of recombinant human estrone sulfatase expressed in CHO cells using 4-methylumbelliferyl sulfate as substrate by fluorimetric assay
Eur J Med Chem 114: 170-90 (2016)
BindingDB Entry DOI: 10.7270/Q26Q2048