BDBM50151354 5-(8-Methyl-[1,5]naphthyridin-2-yl)-4-pyridin-2-yl-thiazol-2-ylamine::CHEMBL182354
SMILES: Cc1ccnc2ccc(nc12)-c1sc(N)nc1-c1ccccn1
InChI Key: InChIKey=QUSGWHGAKWNEQW-UHFFFAOYSA-N
Data: 2 IC50
Activity Spreadsheet -- Enzyme Inhibition Constant Data from BindingDB
Found 2 hits for monomerid = 50151354
Trg + Lig
Ki
nM
ΔG°
kcal/mole
IC50
nM
Kd
nM
EC50/IC50
nM
koff
s-1
kon
M-1s-1
pHTemp
°C
TGF-beta receptor type-1
(Homo sapiens (Human))
BDBM50151354
(5-(8-Methyl-[1,5]naphthyridin-2-yl)-4-pyridin-2-yl...)
Show SMILES Cc1ccnc2ccc(nc12)-c1sc(N)nc1-c1ccccn1
Show InChI InChI=1S/C17H13N5S/c1-10-7-9-20-12-5-6-13(21-14(10)12)16-15(22-17(18)23-16)11-4-2-3-8-19-11/h2-9H,1H3,(H2,18,22)
n/an/a 220n/an/an/an/an/an/a
GlaxoSmithKline
Curated by ChEMBL
Assay Description
Stimulation of Transforming growth factor beta receptor I kinase in HepG2 cells
J Med Chem 47: 4494-506 (2004)
Article DOI: 10.1021/jm0400247
BindingDB Entry DOI: 10.7270/Q2VQ325T
TGF-beta receptor type-1
(Homo sapiens (Human))
BDBM50151354
(5-(8-Methyl-[1,5]naphthyridin-2-yl)-4-pyridin-2-yl...)
Show SMILES Cc1ccnc2ccc(nc12)-c1sc(N)nc1-c1ccccn1
Show InChI InChI=1S/C17H13N5S/c1-10-7-9-20-12-5-6-13(21-14(10)12)16-15(22-17(18)23-16)11-4-2-3-8-19-11/h2-9H,1H3,(H2,18,22)
n/an/a 30n/an/an/an/an/an/a
GlaxoSmithKline
Curated by ChEMBL
Assay Description
Binding affinity to Activin A receptor type II-like kinase (ALK5) in fluorescence polarization binding assay; Range is (0.021-0.042)
J Med Chem 47: 4494-506 (2004)
Article DOI: 10.1021/jm0400247
BindingDB Entry DOI: 10.7270/Q2VQ325T