BDBM50151850 8-Benzyl-2,3,9,10-tetramethoxy-5,8,13,13a-tetrahydro-6H-isoquino[3,2-a]isoquinoline::CHEMBL186873
SMILES: COc1cc2CCN3C(Cc4ccccc4)c4c(CC3c2cc1OC)ccc(OC)c4OC
InChI Key: InChIKey=SXTAUSJLLADWLQ-UHFFFAOYSA-N
Data: 1 IC50
Activity Spreadsheet -- Enzyme Inhibition Constant Data from BindingDB
Found 1 hit for monomerid = 50151850
Trg + Lig
Ki
nM
ΔG°
kcal/mole
IC50
nM
Kd
nM
EC50/IC50
nM
koff
s-1
kon
M-1s-1
pHTemp
°C
Potassium voltage-gated channel subfamily H member 2
(Homo sapiens (Human))
BDBM50151850
(8-Benzyl-2,3,9,10-tetramethoxy-5,8,13,13a-tetrahyd...)
Show SMILES COc1cc2CCN3C(Cc4ccccc4)c4c(CC3c2cc1OC)ccc(OC)c4OC
Show InChI InChI=1S/C28H31NO4/c1-30-24-11-10-20-15-22-21-17-26(32-3)25(31-2)16-19(21)12-13-29(22)23(27(20)28(24)33-4)14-18-8-6-5-7-9-18/h5-11,16-17,22-23H,12-15H2,1-4H3
Reactome pathway
n/an/a 1.40E+4n/an/an/an/an/an/a
China Pharmaceutical University
Curated by ChEMBL
Assay Description
Inhibitory concentration against IKr potassium channel
Bioorg Med Chem Lett 14: 4771-7 (2004)
Article DOI: 10.1016/j.bmcl.2004.06.070
BindingDB Entry DOI: 10.7270/Q208661K