null
SMILES: COc1ccc(CCN(C)CCOc2ccc(NS(C)(=O)=O)cc2N)cc1OC
InChI Key: InChIKey=ZOQHJQODUHVVEV-UHFFFAOYSA-N
Activity Spreadsheet -- Enzyme Inhibition Constant Data from BindingDB
Found 1 hit for monomerid = 50151861
Trg + Lig
Ki
nM
ΔG°
kcal/mole
IC50
nM
Kd
nM
EC50/IC50
nM
koff
s-1
kon
M-1s-1
pHTemp
°C
Potassium voltage-gated channel subfamily H member 2
(Homo sapiens (Human))
BDBM50151861
(CHEMBL353985 | N-[3-Amino-4-(2-{[2-(3,4-dimethoxy-...)
Show SMILES COc1ccc(CCN(C)CCOc2ccc(NS(C)(=O)=O)cc2N)cc1OC
Show InChI InChI=1S/C20H29N3O5S/c1-23(10-9-15-5-7-19(26-2)20(13-15)27-3)11-12-28-18-8-6-16(14-17(18)21)22-29(4,24)25/h5-8,13-14,22H,9-12,21H2,1-4H3
Reactome pathway
n/an/a 1.00E+3n/an/an/an/an/an/a
China Pharmaceutical University
Curated by ChEMBL
Assay Description
Inhibitory concentration against IKr potassium channel
Bioorg Med Chem Lett 14: 4771-7 (2004)
Article DOI: 10.1016/j.bmcl.2004.06.070
BindingDB Entry DOI: 10.7270/Q208661K