BDBM50151958 3-{4-[4-(2,3-Dihydro-benzofuran-5-yl)-piperazin-1-yl]-butyl}-1H-indole-5-carboxylic acid amide::CHEMBL363292
SMILES: NC(=O)c1ccc2[nH]cc(CCCCN3CCN(CC3)c3ccc4OCCc4c3)c2c1
InChI Key: InChIKey=UMXKZXWFCNSZOX-UHFFFAOYSA-N
Data: 2 IC50
Activity Spreadsheet -- Enzyme Inhibition Constant Data from BindingDB
Found 2 hits for monomerid = 50151958
Trg + Lig
Ki
nM
ΔG°
kcal/mole
IC50
nM
Kd
nM
EC50/IC50
nM
koff
s-1
kon
M-1s-1
pHTemp
°C
D(2) dopamine receptor
(Rattus norvegicus (rat))
BDBM50151958
(3-{4-[4-(2,3-Dihydro-benzofuran-5-yl)-piperazin-1-...)
Show SMILES NC(=O)c1ccc2[nH]cc(CCCCN3CCN(CC3)c3ccc4OCCc4c3)c2c1
Show InChI InChI=1S/C25H30N4O2/c26-25(30)19-4-6-23-22(16-19)20(17-27-23)3-1-2-9-28-10-12-29(13-11-28)21-5-7-24-18(15-21)8-14-31-24/h4-7,15-17,27H,1-3,8-14H2,(H2,26,30)
Reactome pathway
n/an/a>100n/an/an/an/an/an/a
Merck KGaA
Curated by ChEMBL
Assay Description
Displacement of [3H]-spiperone from dopamine D2 receptor of rat striatal membranes
J Med Chem 47: 4677-83 (2004)
Article DOI: 10.1021/jm040792y
BindingDB Entry DOI: 10.7270/Q28S4PCR
5-hydroxytryptamine receptor 1A
(Rattus norvegicus (rat))
BDBM50151958
(3-{4-[4-(2,3-Dihydro-benzofuran-5-yl)-piperazin-1-...)
Show SMILES NC(=O)c1ccc2[nH]cc(CCCCN3CCN(CC3)c3ccc4OCCc4c3)c2c1
Show InChI InChI=1S/C25H30N4O2/c26-25(30)19-4-6-23-22(16-19)20(17-27-23)3-1-2-9-28-10-12-29(13-11-28)21-5-7-24-18(15-21)8-14-31-24/h4-7,15-17,27H,1-3,8-14H2,(H2,26,30)
n/an/a 0.5n/an/an/an/an/an/a
Merck KGaA
Curated by ChEMBL
Assay Description
Inhibition of 8-OH DPAT bindign to rat hydroxytryptamine 1A receptor expressed in CHO cells
J Med Chem 47: 4677-83 (2004)
Article DOI: 10.1021/jm040792y
BindingDB Entry DOI: 10.7270/Q28S4PCR