BDBM50152009 3-{4-[4-(2,3-Dihydro-benzo[1,4]dioxin-6-yl)-piperazin-1-yl]-butyl}-1H-indole-5-carbaldehyde oxime::CHEMBL185730
SMILES: O=NCc1ccc2[nH]cc(CCCCN3CCN(CC3)c3ccc4OCCOc4c3)c2c1
InChI Key: InChIKey=WMMPFCPGWJRXLU-UHFFFAOYSA-N
Data: 3 IC50
Activity Spreadsheet -- Enzyme Inhibition Constant Data from BindingDB
Found 3 hits for monomerid = 50152009
Trg + Lig
Ki
nM
ΔG°
kcal/mole
IC50
nM
Kd
nM
EC50/IC50
nM
koff
s-1
kon
M-1s-1
pHTemp
°C
Sodium-dependent serotonin transporter
(Rattus norvegicus (rat))
BDBM50152009
(3-{4-[4-(2,3-Dihydro-benzo[1,4]dioxin-6-yl)-pipera...)
Show SMILES O=NCc1ccc2[nH]cc(CCCCN3CCN(CC3)c3ccc4OCCOc4c3)c2c1
Show InChI InChI=1S/C25H30N4O3/c30-27-17-19-4-6-23-22(15-19)20(18-26-23)3-1-2-8-28-9-11-29(12-10-28)21-5-7-24-25(16-21)32-14-13-31-24/h4-7,15-16,18,26H,1-3,8-14,17H2
n/an/a 5n/an/an/an/an/an/a
Merck KGaA
Curated by ChEMBL
Assay Description
Inhibition of [3H]-5-HT re-uptake in rat synaptosomes
J Med Chem 47: 4684-92 (2004)
Article DOI: 10.1021/jm040793q
BindingDB Entry DOI: 10.7270/Q2513XPS
5-hydroxytryptamine receptor 1A
(Rattus norvegicus (rat))
BDBM50152009
(3-{4-[4-(2,3-Dihydro-benzo[1,4]dioxin-6-yl)-pipera...)
Show SMILES O=NCc1ccc2[nH]cc(CCCCN3CCN(CC3)c3ccc4OCCOc4c3)c2c1
Show InChI InChI=1S/C25H30N4O3/c30-27-17-19-4-6-23-22(15-19)20(18-26-23)3-1-2-8-28-9-11-29(12-10-28)21-5-7-24-25(16-21)32-14-13-31-24/h4-7,15-16,18,26H,1-3,8-14,17H2
n/an/a 0.400n/an/an/an/an/an/a
Merck KGaA
Curated by ChEMBL
Assay Description
Inhibition of 8-OH DPAT binding to rat hydroxytryptamine 1A receptor expresssed in CHO cells
J Med Chem 47: 4684-92 (2004)
Article DOI: 10.1021/jm040793q
BindingDB Entry DOI: 10.7270/Q2513XPS
D(2) dopamine receptor
(Rattus norvegicus (rat))
BDBM50152009
(3-{4-[4-(2,3-Dihydro-benzo[1,4]dioxin-6-yl)-pipera...)
Show SMILES O=NCc1ccc2[nH]cc(CCCCN3CCN(CC3)c3ccc4OCCOc4c3)c2c1
Show InChI InChI=1S/C25H30N4O3/c30-27-17-19-4-6-23-22(15-19)20(18-26-23)3-1-2-8-28-9-11-29(12-10-28)21-5-7-24-25(16-21)32-14-13-31-24/h4-7,15-16,18,26H,1-3,8-14,17H2
Reactome pathway
n/an/a 9.40n/an/an/an/an/an/a
Merck KGaA
Curated by ChEMBL
Assay Description
Displacement of [3H]-spiperone from dopamine D2 receptor of rat striatal membranes
J Med Chem 47: 4684-92 (2004)
Article DOI: 10.1021/jm040793q
BindingDB Entry DOI: 10.7270/Q2513XPS