BDBM50152010 3-{4-[4-(3-Cyano-4-hydroxy-phenyl)-piperazin-1-yl]-butyl}-1H-indole-5-carbonitrile::CHEMBL363754
SMILES: Oc1ccc(cc1C#N)N1CCN(CCCCc2c[nH]c3ccc(cc23)C#N)CC1
InChI Key: InChIKey=VUPDCEKJOFIAMS-UHFFFAOYSA-N
Data: 3 IC50
Activity Spreadsheet -- Enzyme Inhibition Constant Data from BindingDB
Found 3 hits for monomerid = 50152010
Trg + Lig
Ki
nM
ΔG°
kcal/mole
IC50
nM
Kd
nM
EC50/IC50
nM
koff
s-1
kon
M-1s-1
pHTemp
°C
5-hydroxytryptamine receptor 1A
(Rattus norvegicus (rat))
BDBM50152010
(3-{4-[4-(3-Cyano-4-hydroxy-phenyl)-piperazin-1-yl]...)
Show SMILES Oc1ccc(cc1C#N)N1CCN(CCCCc2c[nH]c3ccc(cc23)C#N)CC1
Show InChI InChI=1S/C24H25N5O/c25-15-18-4-6-23-22(13-18)19(17-27-23)3-1-2-8-28-9-11-29(12-10-28)21-5-7-24(30)20(14-21)16-26/h4-7,13-14,17,27,30H,1-3,8-12H2
n/an/a 400n/an/an/an/an/an/a
Merck KGaA
Curated by ChEMBL
Assay Description
Inhibition of 8-OH DPAT binding to rat hydroxytryptamine 1A receptor expresssed in CHO cells
J Med Chem 47: 4684-92 (2004)
Article DOI: 10.1021/jm040793q
BindingDB Entry DOI: 10.7270/Q2513XPS
Sodium-dependent serotonin transporter
(Rattus norvegicus (rat))
BDBM50152010
(3-{4-[4-(3-Cyano-4-hydroxy-phenyl)-piperazin-1-yl]...)
Show SMILES Oc1ccc(cc1C#N)N1CCN(CCCCc2c[nH]c3ccc(cc23)C#N)CC1
Show InChI InChI=1S/C24H25N5O/c25-15-18-4-6-23-22(13-18)19(17-27-23)3-1-2-8-28-9-11-29(12-10-28)21-5-7-24(30)20(14-21)16-26/h4-7,13-14,17,27,30H,1-3,8-12H2
n/an/a 0.800n/an/an/an/an/an/a
Merck KGaA
Curated by ChEMBL
Assay Description
Inhibition of [3H]-5-HT re-uptake in rat synaptosomes
J Med Chem 47: 4684-92 (2004)
Article DOI: 10.1021/jm040793q
BindingDB Entry DOI: 10.7270/Q2513XPS
D(2) dopamine receptor
(Rattus norvegicus (rat))
BDBM50152010
(3-{4-[4-(3-Cyano-4-hydroxy-phenyl)-piperazin-1-yl]...)
Show SMILES Oc1ccc(cc1C#N)N1CCN(CCCCc2c[nH]c3ccc(cc23)C#N)CC1
Show InChI InChI=1S/C24H25N5O/c25-15-18-4-6-23-22(13-18)19(17-27-23)3-1-2-8-28-9-11-29(12-10-28)21-5-7-24(30)20(14-21)16-26/h4-7,13-14,17,27,30H,1-3,8-12H2
Reactome pathway
n/an/a 43n/an/an/an/an/an/a
Merck KGaA
Curated by ChEMBL
Assay Description
Displacement of [3H]-spiperone from dopamine D2 receptor of rat striatal membranes
J Med Chem 47: 4684-92 (2004)
Article DOI: 10.1021/jm040793q
BindingDB Entry DOI: 10.7270/Q2513XPS