BDBM50152137 CHEMBL3781267
SMILES: Nc1nccc(NCCCO)n1
InChI Key: InChIKey=XMHROPCHRVZNHW-UHFFFAOYSA-N
Data: 1 IC50
Activity Spreadsheet -- Enzyme Inhibition Constant Data from BindingDB
Found 1 hit for monomerid = 50152137
Trg + Lig
Ki
nM
ΔG°
kcal/mole
IC50
nM
Kd
nM
EC50/IC50
nM
koff
s-1
kon
M-1s-1
pHTemp
°C
MutT homolog 1 protein (MTH1)
(Homo sapiens (Human))
BDBM50152137
(CHEMBL3781267)
Show SMILES Nc1nccc(NCCCO)n1
Show InChI InChI=1S/C7H12N4O/c8-7-10-4-2-6(11-7)9-3-1-5-12/h2,4,12H,1,3,5H2,(H3,8,9,10,11)
n/an/a 2.98E+3n/an/an/an/an/an/a
MD Anderson Cancer Center
Curated by ChEMBL
Assay Description
Inhibition of recombinant MTH1 (unknown origin) assessed as hydrolysis of 8-oxodGTP to 8-oxodGMP and pyrophosphate by PPiLight assay
Bioorg Med Chem Lett 26: 1503-7 (2016)
BindingDB Entry DOI: 10.7270/Q20K2BF6