BDBM50152158 CHEMBL3779965
SMILES: OC(=O)c1noc(c1-c1ccc(Cl)cc1)-c1ccc(OCc2ccccc2C(F)(F)F)cc1
InChI Key: InChIKey=FROISUPXKWFQQV-UHFFFAOYSA-N
Data: 2 IC50
Activity Spreadsheet -- Enzyme Inhibition Constant Data from BindingDB
Found 2 hits for monomerid = 50152158
Trg + Lig
Ki
nM
ΔG°
kcal/mole
IC50
nM
Kd
nM
EC50/IC50
nM
koff
s-1
kon
M-1s-1
pHTemp
°C
Arachidonate 5-lipoxygenase
(Homo sapiens (Human))
BDBM50152158
(CHEMBL3779965)
Show SMILES OC(=O)c1noc(c1-c1ccc(Cl)cc1)-c1ccc(OCc2ccccc2C(F)(F)F)cc1
Show InChI InChI=1S/C24H15ClF3NO4/c25-17-9-5-14(6-10-17)20-21(23(30)31)29-33-22(20)15-7-11-18(12-8-15)32-13-16-3-1-2-4-19(16)24(26,27)28/h1-12H,13H2,(H,30,31)
Reactome pathway
n/an/a 6.00E+3n/an/an/an/an/an/a
Gazi University
Curated by ChEMBL
Assay Description
Inhibition of recombinant human 5-LO expressed in Escherichia coli BL21 assessed as 5-LO product formation preincubated for 15 mins followed by addit...
Eur J Med Chem 113: 1-10 (2016)
BindingDB Entry DOI: 10.7270/Q2BV7JHB
5-lipoxygenase/FLAP
(Homo sapiens (Human))
BDBM50152158
(CHEMBL3779965)
Show SMILES OC(=O)c1noc(c1-c1ccc(Cl)cc1)-c1ccc(OCc2ccccc2C(F)(F)F)cc1
Show InChI InChI=1S/C24H15ClF3NO4/c25-17-9-5-14(6-10-17)20-21(23(30)31)29-33-22(20)15-7-11-18(12-8-15)32-13-16-3-1-2-4-19(16)24(26,27)28/h1-12H,13H2,(H,30,31)
Reactome pathway
n/an/a 770n/an/an/an/an/an/a
Gazi University
Curated by ChEMBL
Assay Description
Inhibition of FLAP in Ca+2 ionophore A23187 stimulated human neutrophils assessed as 5-LO product formation preincubated for 15 mins measured after 1...
Eur J Med Chem 113: 1-10 (2016)
BindingDB Entry DOI: 10.7270/Q2BV7JHB