BDBM50152343 4-[6-Methoxy-7-(3-piperidin-1-yl-propoxy)-quinazolin-4-yl]-piperazine-1-carbothioic acid (6-methyl-pyridin-3-ylmethyl)-amide::CHEMBL184235
SMILES: COc1cc2c(ncnc2cc1OCCCN1CCCCC1)N1CCN(CC1)C(=S)NCc1ccc(C)nc1
InChI Key: InChIKey=BGFKWWVJYJAFCM-UHFFFAOYSA-N
Data: 3 IC50
Activity Spreadsheet -- Enzyme Inhibition Constant Data from BindingDB
Found 3 hits for monomerid = 50152343
Trg + Lig
Ki
nM
ΔG°
kcal/mole
IC50
nM
Kd
nM
EC50/IC50
nM
koff
s-1
kon
M-1s-1
pHTemp
°C
Platelet-derived growth factor receptor beta
(Homo sapiens (Human))
BDBM50152343
(4-[6-Methoxy-7-(3-piperidin-1-yl-propoxy)-quinazol...)
Show SMILES COc1cc2c(ncnc2cc1OCCCN1CCCCC1)N1CCN(CC1)C(=S)NCc1ccc(C)nc1
Show InChI InChI=1S/C29H39N7O2S/c1-22-7-8-23(19-30-22)20-31-29(39)36-14-12-35(13-15-36)28-24-17-26(37-2)27(18-25(24)32-21-33-28)38-16-6-11-34-9-4-3-5-10-34/h7-8,17-19,21H,3-6,9-16,20H2,1-2H3,(H,31,39)
NCI pathway
Reactome pathway
n/an/a 90n/an/an/an/an/an/a
and In Vivo Sciences Millennium Pharmaceuticals, Inc.
Curated by ChEMBL
Assay Description
In vitro inhibition of Platelet derived growth factor receptor beta autophosphorylation in MG-63 cells with 45% human plasma
Bioorg Med Chem Lett 14: 4867-72 (2004)
Article DOI: 10.1016/j.bmcl.2004.07.041
BindingDB Entry DOI: 10.7270/Q2VM4BQN
Platelet-derived growth factor receptor beta
(Homo sapiens (Human))
BDBM50152343
(4-[6-Methoxy-7-(3-piperidin-1-yl-propoxy)-quinazol...)
Show SMILES COc1cc2c(ncnc2cc1OCCCN1CCCCC1)N1CCN(CC1)C(=S)NCc1ccc(C)nc1
Show InChI InChI=1S/C29H39N7O2S/c1-22-7-8-23(19-30-22)20-31-29(39)36-14-12-35(13-15-36)28-24-17-26(37-2)27(18-25(24)32-21-33-28)38-16-6-11-34-9-4-3-5-10-34/h7-8,17-19,21H,3-6,9-16,20H2,1-2H3,(H,31,39)
NCI pathway
Reactome pathway
n/an/a 140n/an/an/an/an/an/a
and In Vivo Sciences Millennium Pharmaceuticals, Inc.
Curated by ChEMBL
Assay Description
Inhibition of Platelet derived growth factor receptor beta autophosphorylation in CHO cells
Bioorg Med Chem Lett 14: 4867-72 (2004)
Article DOI: 10.1016/j.bmcl.2004.07.041
BindingDB Entry DOI: 10.7270/Q2VM4BQN
Platelet-derived growth factor receptor beta
(Homo sapiens (Human))
BDBM50152343
(4-[6-Methoxy-7-(3-piperidin-1-yl-propoxy)-quinazol...)
Show SMILES COc1cc2c(ncnc2cc1OCCCN1CCCCC1)N1CCN(CC1)C(=S)NCc1ccc(C)nc1
Show InChI InChI=1S/C29H39N7O2S/c1-22-7-8-23(19-30-22)20-31-29(39)36-14-12-35(13-15-36)28-24-17-26(37-2)27(18-25(24)32-21-33-28)38-16-6-11-34-9-4-3-5-10-34/h7-8,17-19,21H,3-6,9-16,20H2,1-2H3,(H,31,39)
NCI pathway
Reactome pathway
n/an/a 140n/an/an/an/an/an/a
and In Vivo Sciences Millennium Pharmaceuticals, Inc.
Curated by ChEMBL
Assay Description
In vitro inhibition of Platelet derived growth factor receptor beta autophosphorylation in MG-63 cells without plasma
Bioorg Med Chem Lett 14: 4867-72 (2004)
Article DOI: 10.1016/j.bmcl.2004.07.041
BindingDB Entry DOI: 10.7270/Q2VM4BQN