null
SMILES: COc1cc2c(ncnc2cc1OCCCN1CCCCC1)N1CCN(CC1)C(=S)Nc1ccc(cn1)-c1ccccc1
InChI Key: InChIKey=CQWINCPKIGLAQW-UHFFFAOYSA-N
Activity Spreadsheet -- Enzyme Inhibition Constant Data from BindingDB
Found 2 hits for monomerid = 50152387
Trg + Lig
Ki
nM
ΔG°
kcal/mole
IC50
nM
Kd
nM
EC50/IC50
nM
koff
s-1
kon
M-1s-1
pHTemp
°C
Platelet-derived growth factor receptor beta
(Homo sapiens (Human))
BDBM50152387
(4-[6-Methoxy-7-(3-piperidin-1-yl-propoxy)-quinazol...)
Show SMILES COc1cc2c(ncnc2cc1OCCCN1CCCCC1)N1CCN(CC1)C(=S)Nc1ccc(cn1)-c1ccccc1
Show InChI InChI=1S/C33H39N7O2S/c1-41-29-21-27-28(22-30(29)42-20-8-15-38-13-6-3-7-14-38)35-24-36-32(27)39-16-18-40(19-17-39)33(43)37-31-12-11-26(23-34-31)25-9-4-2-5-10-25/h2,4-5,9-12,21-24H,3,6-8,13-20H2,1H3,(H,34,37,43)
NCI pathway
Reactome pathway
n/an/a 550n/an/an/an/an/an/a
and In Vivo Sciences Millennium Pharmaceuticals, Inc.
Curated by ChEMBL
Assay Description
In vitro inhibition of Platelet derived growth factor receptor beta autophosphorylation in MG-63 cells with 45% human plasma
Bioorg Med Chem Lett 14: 4867-72 (2004)
Article DOI: 10.1016/j.bmcl.2004.07.041
BindingDB Entry DOI: 10.7270/Q2VM4BQN
Platelet-derived growth factor receptor beta
(Homo sapiens (Human))
BDBM50152387
(4-[6-Methoxy-7-(3-piperidin-1-yl-propoxy)-quinazol...)
Show SMILES COc1cc2c(ncnc2cc1OCCCN1CCCCC1)N1CCN(CC1)C(=S)Nc1ccc(cn1)-c1ccccc1
Show InChI InChI=1S/C33H39N7O2S/c1-41-29-21-27-28(22-30(29)42-20-8-15-38-13-6-3-7-14-38)35-24-36-32(27)39-16-18-40(19-17-39)33(43)37-31-12-11-26(23-34-31)25-9-4-2-5-10-25/h2,4-5,9-12,21-24H,3,6-8,13-20H2,1H3,(H,34,37,43)
NCI pathway
Reactome pathway
n/an/a 1.98E+3n/an/an/an/an/an/a
and In Vivo Sciences Millennium Pharmaceuticals, Inc.
Curated by ChEMBL
Assay Description
In vitro inhibition of Platelet derived growth factor receptor beta autophosphorylation in MG-63 cells without plasma
Bioorg Med Chem Lett 14: 4867-72 (2004)
Article DOI: 10.1016/j.bmcl.2004.07.041
BindingDB Entry DOI: 10.7270/Q2VM4BQN