null
SMILES: COc1cc2c(ncnc2cc1OCCN1CCCCC1)N1CCN(CC1)C(=S)Nc1ccsc1
InChI Key: InChIKey=XYJRXGZCCYTGOF-UHFFFAOYSA-N
Activity Spreadsheet -- Enzyme Inhibition Constant Data from BindingDB
Found 2 hits for monomerid = 50152391
Trg + Lig
Ki
nM
ΔG°
kcal/mole
IC50
nM
Kd
nM
EC50/IC50
nM
koff
s-1
kon
M-1s-1
pHTemp
°C
Platelet-derived growth factor receptor beta
(Homo sapiens (Human))
BDBM50152391
(4-[6-Methoxy-7-(2-piperidin-1-yl-ethoxy)-quinazoli...)
Show SMILES COc1cc2c(ncnc2cc1OCCN1CCCCC1)N1CCN(CC1)C(=S)Nc1ccsc1
Show InChI InChI=1S/C25H32N6O2S2/c1-32-22-15-20-21(16-23(22)33-13-12-29-6-3-2-4-7-29)26-18-27-24(20)30-8-10-31(11-9-30)25(34)28-19-5-14-35-17-19/h5,14-18H,2-4,6-13H2,1H3,(H,28,34)
NCI pathway
Reactome pathway
n/an/a 740n/an/an/an/an/an/a
and In Vivo Sciences Millennium Pharmaceuticals, Inc.
Curated by ChEMBL
Assay Description
In vitro inhibition of Platelet derived growth factor receptor beta autophosphorylation in MG-63 cells with 45% human plasma
Bioorg Med Chem Lett 14: 4867-72 (2004)
Article DOI: 10.1016/j.bmcl.2004.07.041
BindingDB Entry DOI: 10.7270/Q2VM4BQN
Platelet-derived growth factor receptor beta
(Homo sapiens (Human))
BDBM50152391
(4-[6-Methoxy-7-(2-piperidin-1-yl-ethoxy)-quinazoli...)
Show SMILES COc1cc2c(ncnc2cc1OCCN1CCCCC1)N1CCN(CC1)C(=S)Nc1ccsc1
Show InChI InChI=1S/C25H32N6O2S2/c1-32-22-15-20-21(16-23(22)33-13-12-29-6-3-2-4-7-29)26-18-27-24(20)30-8-10-31(11-9-30)25(34)28-19-5-14-35-17-19/h5,14-18H,2-4,6-13H2,1H3,(H,28,34)
NCI pathway
Reactome pathway
n/an/a 100n/an/an/an/an/an/a
and In Vivo Sciences Millennium Pharmaceuticals, Inc.
Curated by ChEMBL
Assay Description
In vitro inhibition of Platelet derived growth factor receptor beta autophosphorylation in MG-63 cells without plasma
Bioorg Med Chem Lett 14: 4867-72 (2004)
Article DOI: 10.1016/j.bmcl.2004.07.041
BindingDB Entry DOI: 10.7270/Q2VM4BQN