null
SMILES: CC(Cc1ccc2OCOc2c1)N1CCC(C1)Oc1cccc2ccc(N)nc12
InChI Key: InChIKey=OUVJHWNDXJXEKN-UHFFFAOYSA-N
Activity Spreadsheet -- Enzyme Inhibition Constant Data from BindingDB
Found 1 hit for monomerid = 50152502
Trg + Lig
Ki
nM
ΔG°
kcal/mole
IC50
nM
Kd
nM
EC50/IC50
nM
koff
s-1
kon
M-1s-1
pHTemp
°C
Melanin-concentrating hormone receptor 1
(Homo sapiens (Human))
BDBM50152502
(8-[1-(2-Benzo[1,3]dioxol-5-yl-1-methyl-ethyl)-pyrr...)
Show SMILES CC(Cc1ccc2OCOc2c1)N1CCC(C1)Oc1cccc2ccc(N)nc12
Show InChI InChI=1S/C23H25N3O3/c1-15(11-16-5-7-19-21(12-16)28-14-27-19)26-10-9-18(13-26)29-20-4-2-3-17-6-8-22(24)25-23(17)20/h2-8,12,15,18H,9-11,13-14H2,1H3,(H2,24,25)
Reactome pathway
n/an/a 2.20n/an/an/an/an/an/a
Abbott Laboratories
Curated by ChEMBL
Assay Description
Concentration required to inhibit binding of [125I]-MCH radioligand to human Melanin-concentrating hormone receptor 1 in IMR-32 I3.4.2 cell membranes
Bioorg Med Chem Lett 14: 4883-6 (2004)
Article DOI: 10.1016/j.bmcl.2004.07.035
BindingDB Entry DOI: 10.7270/Q2GB23H4