BDBM50152624 5-HYDROXY-2-(4-HYDROXYPHENYL)-1-BENZOFURAN-7-CARBONITRILE::5-Hydroxy-2-(4-hydroxy-phenyl)-benzofuran-7-carbonitrile::CHEMBL363498
SMILES: Oc1ccc(cc1)-c1cc2cc(O)cc(C#N)c2o1
InChI Key: InChIKey=GGEKOZPXKBYLNK-UHFFFAOYSA-N
Data: 2 IC50
PDB links: 1 PDB ID matches this monomer.
Activity Spreadsheet -- Enzyme Inhibition Constant Data from BindingDB
Found 3 hits for monomerid = 50152624
Trg + Lig
Ki
nM
ΔG°
kcal/mole
IC50
nM
Kd
nM
EC50/IC50
nM
koff
s-1
kon
M-1s-1
pHTemp
°C
Estrogen receptor
(Homo sapiens (Human))
BDBM50152624
(5-HYDROXY-2-(4-HYDROXYPHENYL)-1-BENZOFURAN-7-CARBO...)
Show SMILES Oc1ccc(cc1)-c1cc2cc(O)cc(C#N)c2o1
Show InChI InChI=1S/C15H9NO3/c16-8-11-6-13(18)5-10-7-14(19-15(10)11)9-1-3-12(17)4-2-9/h1-7,17-18H
n/an/a 46n/an/an/an/an/an/a
Wyeth Research
Curated by ChEMBL
Assay Description
Binding affinity for human Estrogen receptor alpha
Bioorg Med Chem Lett 14: 4925-9 (2004)
Article DOI: 10.1016/j.bmcl.2004.07.029
BindingDB Entry DOI: 10.7270/Q2TM79K8
Estrogen receptor
(Homo sapiens (Human))
BDBM50152624
(5-HYDROXY-2-(4-HYDROXYPHENYL)-1-BENZOFURAN-7-CARBO...)
Show SMILES Oc1ccc(cc1)-c1cc2cc(O)cc(C#N)c2o1
Show InChI InChI=1S/C15H9NO3/c16-8-11-6-13(18)5-10-7-14(19-15(10)11)9-1-3-12(17)4-2-9/h1-7,17-18H
n/an/an/an/a 1.90n/an/an/an/a
TBA
Citation and Details
3D
3D Structure (crystal)
Estradiol receptor beta (ERβ)
(Homo sapiens (Human))
BDBM50152624
(5-HYDROXY-2-(4-HYDROXYPHENYL)-1-BENZOFURAN-7-CARBO...)
Show SMILES Oc1ccc(cc1)-c1cc2cc(O)cc(C#N)c2o1
Show InChI InChI=1S/C15H9NO3/c16-8-11-6-13(18)5-10-7-14(19-15(10)11)9-1-3-12(17)4-2-9/h1-7,17-18H
n/an/a 2.20n/an/an/an/an/an/a
Wyeth Research
Curated by ChEMBL
Assay Description
Binding affinity for human Estrogen receptor beta
Bioorg Med Chem Lett 14: 4925-9 (2004)
Article DOI: 10.1016/j.bmcl.2004.07.029
BindingDB Entry DOI: 10.7270/Q2TM79K8
3D
3D Structure (crystal)