BDBM50153031 (S)-3-(2-Methyl-pyrimidin-5-yl)-9-(5,6,7,8-tetrahydro-[1,8]naphthyridin-2-yl)-nonanoic acid::CHEMBL187289
SMILES: Cc1ncc(cn1)[C@@H](CCCCCCc1ccc2CCCNc2n1)CC(O)=O
InChI Key: InChIKey=NJDBZBVQIMZWPP-SFHVURJKSA-N
Data: 1 IC50
Activity Spreadsheet -- Enzyme Inhibition Constant Data from BindingDB
Found 1 hit for monomerid = 50153031
Trg + Lig
Ki
nM
ΔG°
kcal/mole
IC50
nM
Kd
nM
EC50/IC50
nM
koff
s-1
kon
M-1s-1
pHTemp
°C
ITGAV/ITGB3
(Homo sapiens (Human))
BDBM50153031
((S)-3-(2-Methyl-pyrimidin-5-yl)-9-(5,6,7,8-tetrahy...)
Show SMILES Cc1ncc(cn1)[C@@H](CCCCCCc1ccc2CCCNc2n1)CC(O)=O
Show InChI InChI=1S/C22H30N4O2/c1-16-24-14-19(15-25-16)18(13-21(27)28)7-4-2-3-5-9-20-11-10-17-8-6-12-23-22(17)26-20/h10-11,14-15,18H,2-9,12-13H2,1H3,(H,23,26)(H,27,28)/t18-/m0/s1
n/an/a 0.0800n/an/an/an/an/an/a
Merck Research Laboratories
Curated by ChEMBL
Assay Description
Inhibitory activity against alpha v beta-3 receptor using scintillation proximity assay (SPAV3)
J Med Chem 47: 4829-37 (2004)
Article DOI: 10.1021/jm049874c
BindingDB Entry DOI: 10.7270/Q2CJ8FQC