null
SMILES: COC1C[C@H](CC(C)[C@H]2OC(=O)C3CCCCN3C(=O)C(=O)[C@]3(O)CC([C@H](C[C@H]3C)OC)[C@H](C[C@@H](C)C\C(C)=C\[C@@H](CC=C)C(=O)C[C@H](O)[C@H]2C)OC)CC[C@H]1CC(=O)Nc1ccc(CCCC(O)=O)cc1
InChI Key: InChIKey=WQBUAHYPIRIKLH-CEZHGMQKSA-N
Activity Spreadsheet -- Enzyme Inhibition Constant Data from BindingDB
Found 1 hit for monomerid = 50153091
Trg + Lig
Ki
nM
ΔG°
kcal/mole
IC50
nM
Kd
nM
EC50/IC50
nM
koff
s-1
kon
M-1s-1
pHTemp
°C
Serine/threonine-protein kinase mTOR
(Homo sapiens (Human))
BDBM50153091
(CHEMBL265123 | Macrolide derivative)
Show SMILES COC1C[C@H](CC(C)[C@H]2OC(=O)C3CCCCN3C(=O)C(=O)[C@]3(O)CC([C@H](C[C@H]3C)OC)[C@H](C[C@@H](C)C\C(C)=C\[C@@H](CC=C)C(=O)C[C@H](O)[C@H]2C)OC)CC[C@H]1CC(=O)Nc1ccc(CCCC(O)=O)cc1 |t:40|
Show InChI InChI=1S/C57H86N2O13/c1-10-14-41-26-34(2)25-35(3)27-49(70-8)44-33-57(68,37(5)29-50(44)71-9)54(65)55(66)59-24-12-11-16-45(59)56(67)72-53(38(6)46(60)32-47(41)61)36(4)28-40-18-21-42(48(30-40)69-7)31-51(62)58-43-22-19-39(20-23-43)15-13-17-52(63)64/h10,19-20,22-23,26,35-38,40-42,44-46,48-50,53,60,68H,1,11-18,21,24-25,27-33H2,2-9H3,(H,58,62)(H,63,64)/b34-26+/t35-,36?,37+,38+,40-,41+,42-,44?,45?,46-,48?,49-,50-,53+,57-/m0/s1
NCI pathway
Reactome pathway
n/an/a 1.88n/an/an/an/an/an/a
Novartis Institutes for BioMedical Research and Novartis Pharma Development
Curated by ChEMBL
Assay Description
Inhibitory activity against macrophilin (FKBP-12)
J Med Chem 47: 4950-7 (2004)
Article DOI: 10.1021/jm031101l
BindingDB Entry DOI: 10.7270/Q21N81WK