BDBM50153158 CHEMBL2098408::GSK1073647A::TCMDC-142704
SMILES: CCS(=O)(=O)c1cccc(c1)C(=O)Nc1nc(cs1)-c1ccccn1
InChI Key: InChIKey=IGOJWQXZHMQTNM-UHFFFAOYSA-N
Data: 3 IC50
Activity Spreadsheet -- Enzyme Inhibition Constant Data from BindingDB
Found 3 hits for monomerid = 50153158
Trg + Lig
Ki
nM
ΔG°
kcal/mole
IC50
nM
Kd
nM
EC50/IC50
nM
koff
s-1
kon
M-1s-1
pHTemp
°C
Lysine-specific demethylase 4A
(Homo sapiens (Human))
BDBM50153158
(CHEMBL2098408 | GSK1073647A | TCMDC-142704)
Show SMILES CCS(=O)(=O)c1cccc(c1)C(=O)Nc1nc(cs1)-c1ccccn1
Show InChI InChI=1S/C17H15N3O3S2/c1-2-25(22,23)13-7-5-6-12(10-13)16(21)20-17-19-15(11-24-17)14-8-3-4-9-18-14/h3-11H,2H2,1H3,(H,19,20,21)
n/an/a 1.32E+4n/an/an/an/an/an/a
The Institute of Cancer Research
Curated by ChEMBL
Assay Description
Inhibition of human N-terminal His-tagged KDM4A (1 to 359 residues) expressed in Escherichia coli using biotin-H3K9me3 as substrate preincubated for ...
J Med Chem 59: 1388-409 (2016)
BindingDB Entry DOI: 10.7270/Q2W097TR
Lysine-specific demethylase 5B
(Homo sapiens (Human))
BDBM50153158
(CHEMBL2098408 | GSK1073647A | TCMDC-142704)
Show SMILES CCS(=O)(=O)c1cccc(c1)C(=O)Nc1nc(cs1)-c1ccccn1
Show InChI InChI=1S/C17H15N3O3S2/c1-2-25(22,23)13-7-5-6-12(10-13)16(21)20-17-19-15(11-24-17)14-8-3-4-9-18-14/h3-11H,2H2,1H3,(H,19,20,21)
n/an/a 5.26E+4n/an/an/an/an/an/a
The Institute of Cancer Research
Curated by ChEMBL
Assay Description
Inhibition of KDM5B (unknown origin) using biotin-H3K4me3 as substrate preincubated for 15 mins followed by substrate addition measured after 20 mins...
J Med Chem 59: 1388-409 (2016)
BindingDB Entry DOI: 10.7270/Q2W097TR
Lysine-specific demethylase 4B
(Homo sapiens (Human))
BDBM50153158
(CHEMBL2098408 | GSK1073647A | TCMDC-142704)
Show SMILES CCS(=O)(=O)c1cccc(c1)C(=O)Nc1nc(cs1)-c1ccccn1
Show InChI InChI=1S/C17H15N3O3S2/c1-2-25(22,23)13-7-5-6-12(10-13)16(21)20-17-19-15(11-24-17)14-8-3-4-9-18-14/h3-11H,2H2,1H3,(H,19,20,21)
n/an/a 1.09E+4n/an/an/an/an/an/a
The Institute of Cancer Research
Curated by ChEMBL
Assay Description
Inhibition of recombinant human N-terminal GST-tagged KDM4B (1 to 500 residues) expressed in baculovirus infected sf9 cells using biotin-H3K9me3 as s...
J Med Chem 59: 1388-409 (2016)
BindingDB Entry DOI: 10.7270/Q2W097TR