BDBM50153654 CHEMBL3774848
SMILES: CC(C)Cc1ccc(cc1)-c1nnc(CCC(=O)Nc2ccc(C)cc2C)n1C1CC1
InChI Key: InChIKey=ZZTUGIVZKAXQBI-UHFFFAOYSA-N
Data: 2 EC50
Activity Spreadsheet -- Enzyme Inhibition Constant Data from BindingDB
Found 2 hits for monomerid = 50153654
Trg + Lig
Ki
nM
ΔG°
kcal/mole
IC50
nM
Kd
nM
EC50/IC50
nM
koff
s-1
kon
M-1s-1
pHTemp
°C
Nuclear receptor ROR-gamma
(Mus musculus)
BDBM50153654
(CHEMBL3774848)
Show SMILES CC(C)Cc1ccc(cc1)-c1nnc(CCC(=O)Nc2ccc(C)cc2C)n1C1CC1
Show InChI InChI=1S/C26H32N4O/c1-17(2)15-20-6-8-21(9-7-20)26-29-28-24(30(26)22-10-11-22)13-14-25(31)27-23-12-5-18(3)16-19(23)4/h5-9,12,16-17,22H,10-11,13-15H2,1-4H3,(H,27,31)
Reactome pathway
n/an/an/an/a 120n/an/an/an/a
Central Pharmaceutical Research Institute
Curated by ChEMBL
Assay Description
Inhibition of mouse RORgamma ligand binding domain (Isoleucine 251 to Lysine 516) expressed in CHOK1 cells incubated for 2 days by Gal4 luciferase re...
ACS Med Chem Lett 7: 23-7 (2016)
BindingDB Entry DOI: 10.7270/Q2N58P7P
Nuclear receptor ROR-gamma (RORC)
(Homo sapiens (Human))
BDBM50153654
(CHEMBL3774848)
Show SMILES CC(C)Cc1ccc(cc1)-c1nnc(CCC(=O)Nc2ccc(C)cc2C)n1C1CC1
Show InChI InChI=1S/C26H32N4O/c1-17(2)15-20-6-8-21(9-7-20)26-29-28-24(30(26)22-10-11-22)13-14-25(31)27-23-12-5-18(3)16-19(23)4/h5-9,12,16-17,22H,10-11,13-15H2,1-4H3,(H,27,31)
n/an/an/an/a 1.80E+3n/an/an/an/a
Central Pharmaceutical Research Institute
Curated by ChEMBL
Assay Description
Inhibition of human RORgamma ligand binding domain (Serine 253 to Lysine 518 residues) expressed in CHOK1 cells incubated for 2 days by Gal4 lucifera...
ACS Med Chem Lett 7: 23-7 (2016)
BindingDB Entry DOI: 10.7270/Q2N58P7P