BDBM50153694 CHEMBL3774584
SMILES: C[C@@H]1Cc2cc(O)ccc2[C@H](N1CC(C)(C)F)c1c(F)cc(\C=C\C(O)=O)cc1F
InChI Key: InChIKey=RWZQPEHTNFUUCO-DDRJXTRQSA-N
Data: 2 IC50
Activity Spreadsheet -- Enzyme Inhibition Constant Data from BindingDB
Found 2 hits for monomerid = 50153694
Trg + Lig
Ki
nM
ΔG°
kcal/mole
IC50
nM
Kd
nM
EC50/IC50
nM
koff
s-1
kon
M-1s-1
pHTemp
°C
Estrogen receptor
(Homo sapiens (Human))
BDBM50153694
(CHEMBL3774584)
Show SMILES C[C@@H]1Cc2cc(O)ccc2[C@H](N1CC(C)(C)F)c1c(F)cc(\C=C\C(O)=O)cc1F |r|
Show InChI InChI=1S/C23H24F3NO3/c1-13-8-15-11-16(28)5-6-17(15)22(27(13)12-23(2,3)26)21-18(24)9-14(10-19(21)25)4-7-20(29)30/h4-7,9-11,13,22,28H,8,12H2,1-3H3,(H,29,30)/b7-4+/t13-,22+/m1/s1
n/an/a 0.25n/an/an/an/an/an/a
AstraZeneca
Curated by ChEMBL
Assay Description
Downregulation of ERalpha in human MCF7 cells incubated for 18 to 22 hrs by immunofluorescence assay
ACS Med Chem Lett 7: 94-9 (2016)
BindingDB Entry DOI: 10.7270/Q2HD7XHZ
Estrogen receptor
(Homo sapiens (Human))
BDBM50153694
(CHEMBL3774584)
Show SMILES C[C@@H]1Cc2cc(O)ccc2[C@H](N1CC(C)(C)F)c1c(F)cc(\C=C\C(O)=O)cc1F |r|
Show InChI InChI=1S/C23H24F3NO3/c1-13-8-15-11-16(28)5-6-17(15)22(27(13)12-23(2,3)26)21-18(24)9-14(10-19(21)25)4-7-20(29)30/h4-7,9-11,13,22,28H,8,12H2,1-3H3,(H,29,30)/b7-4+/t13-,22+/m1/s1
n/an/a 0.970n/an/an/an/an/an/a
AstraZeneca
Curated by ChEMBL
Assay Description
Displacement of fluormone ES2 from GST-tagged recombinant human ERalpha LBD after 1 hr by Lanthascreen TR-FRET assay
ACS Med Chem Lett 7: 94-9 (2016)
BindingDB Entry DOI: 10.7270/Q2HD7XHZ