null
SMILES: CC(=O)c1ccc(OCCCCOc2ccc(cc2)-c2nnn[nH]2)c(C)c1O
InChI Key: InChIKey=CUTGCQOPZLWLSV-UHFFFAOYSA-N
Activity Spreadsheet -- Enzyme Inhibition Constant Data from BindingDB
Found 1 hit for monomerid = 50153749
Trg + Lig
Ki
nM
ΔG°
kcal/mole
IC50
nM
Kd
nM
EC50/IC50
nM
koff
s-1
kon
M-1s-1
pHTemp
°C
Metabotropic glutamate receptor 2
(Homo sapiens (Human))
BDBM50153749
(1-(2-Hydroxy-3-methyl-4-{4-[4-(2H-tetrazol-5-yl)-p...)
Show SMILES CC(=O)c1ccc(OCCCCOc2ccc(cc2)-c2nnn[nH]2)c(C)c1O
Show InChI InChI=1S/C20H22N4O4/c1-13-18(10-9-17(14(2)25)19(13)26)28-12-4-3-11-27-16-7-5-15(6-8-16)20-21-23-24-22-20/h5-10,26H,3-4,11-12H2,1-2H3,(H,21,22,23,24)
n/an/an/an/a 3.37E+3n/an/an/an/a
Merck Research Laboratories
Curated by ChEMBL
Assay Description
Effective concentration for binding to human metabotropic glutamate receptor 2 as determined by GTPgammaS assay
Bioorg Med Chem Lett 14: 5329-32 (2004)
Article DOI: 10.1016/j.bmcl.2004.08.020
BindingDB Entry DOI: 10.7270/Q21Z43W0