BDBM50153990 4-[2-(4-Ethoxy-phenyl)-pyrazolo[1,5-b]pyridazin-3-yl]-benzenesulfonamide::CHEMBL186632
SMILES: CCOc1ccc(cc1)-c1nn2ncccc2c1-c1ccc(cc1)S(N)(=O)=O
InChI Key: InChIKey=JWSYDZNIYSFRNJ-UHFFFAOYSA-N
Data: 2 IC50
Activity Spreadsheet -- Enzyme Inhibition Constant Data from BindingDB
Found 2 hits for monomerid = 50153990
Trg + Lig
Ki
nM
ΔG°
kcal/mole
IC50
nM
Kd
nM
EC50/IC50
nM
koff
s-1
kon
M-1s-1
pHTemp
°C
Prostaglandin G/H synthase 2
(Homo sapiens (Human))
BDBM50153990
(4-[2-(4-Ethoxy-phenyl)-pyrazolo[1,5-b]pyridazin-3-...)
Show SMILES CCOc1ccc(cc1)-c1nn2ncccc2c1-c1ccc(cc1)S(N)(=O)=O
Show InChI InChI=1S/C20H18N4O3S/c1-2-27-16-9-5-15(6-10-16)20-19(18-4-3-13-22-24(18)23-20)14-7-11-17(12-8-14)28(21,25)26/h3-13H,2H2,1H3,(H2,21,25,26)
NCI pathway
Reactome pathway
n/an/a 0.440n/an/an/an/an/an/a
GlaxoSmithKline
Curated by ChEMBL
Assay Description
Inhibition of human cyclooxygenase-2 expressed in COS cells
Bioorg Med Chem Lett 14: 5445-8 (2004)
Article DOI: 10.1016/j.bmcl.2004.07.089
BindingDB Entry DOI: 10.7270/Q2RJ4HZ7
Prostaglandin G/H synthase 1
(Homo sapiens (Human))
BDBM50153990
(4-[2-(4-Ethoxy-phenyl)-pyrazolo[1,5-b]pyridazin-3-...)
Show SMILES CCOc1ccc(cc1)-c1nn2ncccc2c1-c1ccc(cc1)S(N)(=O)=O
Show InChI InChI=1S/C20H18N4O3S/c1-2-27-16-9-5-15(6-10-16)20-19(18-4-3-13-22-24(18)23-20)14-7-11-17(12-8-14)28(21,25)26/h3-13H,2H2,1H3,(H2,21,25,26)
n/an/a 3.83E+3n/an/an/an/an/an/a
GlaxoSmithKline
Curated by ChEMBL
Assay Description
Inhibition of human cyclooxygenase-1 expressed in COS cells
Bioorg Med Chem Lett 14: 5445-8 (2004)
Article DOI: 10.1016/j.bmcl.2004.07.089
BindingDB Entry DOI: 10.7270/Q2RJ4HZ7