BDBM50154556 CHEMBL1271200
SMILES: [H][C@@]12C[C@](C)(CC[C@]1(C)CC[C@]1(C)C2=CC(=O)[C@]2([H])[C@@]3(C)CC[C@H](OC(C)=O)C(C)(C)[C@]3([H])CC[C@@]12C)C(N)=O
InChI Key: InChIKey=RTRQMLYKKATHQJ-XWEVEMRCSA-N
Data: 2 IC50
Activity Spreadsheet -- Enzyme Inhibition Constant Data from BindingDB
Found 2 hits for monomerid = 50154556
Trg + Lig
Ki
nM
ΔG°
kcal/mole
IC50
nM
Kd
nM
EC50/IC50
nM
koff
s-1
kon
M-1s-1
pHTemp
°C
Carboxylesterase 2
(Homo sapiens (Human))
BDBM50154556
(CHEMBL1271200)
Show SMILES [H][C@@]12C[C@](C)(CC[C@]1(C)CC[C@]1(C)C2=CC(=O)[C@]2([H])[C@@]3(C)CC[C@H](OC(C)=O)C(C)(C)[C@]3([H])CC[C@@]12C)C(N)=O |r,t:15|
Show InChI InChI=1S/C32H49NO4/c1-19(34)37-24-10-11-30(6)23(27(24,2)3)9-12-32(8)25(30)22(35)17-20-21-18-29(5,26(33)36)14-13-28(21,4)15-16-31(20,32)7/h17,21,23-25H,9-16,18H2,1-8H3,(H2,33,36)/t21-,23-,24-,25+,28+,29-,30-,31+,32+/m0/s1
NCI pathway
n/an/a 7.36E+3n/an/an/an/an/an/a
Dalian Institute of Chemical Physics
Curated by ChEMBL
Assay Description
Inhibition of CE2 in human liver microsomes using fluorescein diacetate as substrate preincubated for 10 mins followed by substrate addition measured...
Eur J Med Chem 112: 280-8 (2016)
BindingDB Entry DOI: 10.7270/Q2TQ63D6
Acyl-CoA: cholesterol acyltransferase (ACAT)
(Homo sapiens (Human))
BDBM50154556
(CHEMBL1271200)
Show SMILES [H][C@@]12C[C@](C)(CC[C@]1(C)CC[C@]1(C)C2=CC(=O)[C@]2([H])[C@@]3(C)CC[C@H](OC(C)=O)C(C)(C)[C@]3([H])CC[C@@]12C)C(N)=O |r,t:15|
Show InChI InChI=1S/C32H49NO4/c1-19(34)37-24-10-11-30(6)23(27(24,2)3)9-12-32(8)25(30)22(35)17-20-21-18-29(5,26(33)36)14-13-28(21,4)15-16-31(20,32)7/h17,21,23-25H,9-16,18H2,1-8H3,(H2,33,36)/t21-,23-,24-,25+,28+,29-,30-,31+,32+/m0/s1
n/an/a 1.10E+4n/an/an/an/an/an/a
Dalian Institute of Chemical Physics
Curated by ChEMBL
Assay Description
Inhibition of CE1 in human liver microsomes using 2-(2-Benzoyl-3-methoxyphenyl) benzothiazole as substrate preincubated for 10 mins followed by subst...
Eur J Med Chem 112: 280-8 (2016)
BindingDB Entry DOI: 10.7270/Q2TQ63D6