BDBM50154619 CHEMBL3775966
SMILES: CCCCCn1cc(C(=O)NC2CCCCC2)c(=O)n2nc(nc12)-c1ccccc1
InChI Key: InChIKey=XHDDGEHNYUZKBB-UHFFFAOYSA-N
Data: 2 KI  1 IC50  1 EC50
Activity Spreadsheet -- Enzyme Inhibition Constant Data from BindingDB
Found 4 hits for monomerid = 50154619
Trg + Lig
Ki
nM
ΔG°
kcal/mole
IC50
nM
Kd
nM
EC50/IC50
nM
koff
s-1
kon
M-1s-1
pHTemp
°C
Cannabinoid receptor 2
(Homo sapiens (Human))
BDBM50154619
(CHEMBL3775966)
Show SMILES CCCCCn1cc(C(=O)NC2CCCCC2)c(=O)n2nc(nc12)-c1ccccc1
Show InChI InChI=1S/C23H29N5O2/c1-2-3-10-15-27-16-19(21(29)24-18-13-8-5-9-14-18)22(30)28-23(27)25-20(26-28)17-11-6-4-7-12-17/h4,6-7,11-12,16,18H,2-3,5,8-10,13-15H2,1H3,(H,24,29)
Reactome pathway
43n/an/an/an/an/an/an/an/a
Universit£ di Ferrara
Curated by ChEMBL
Assay Description
Displacement of [3H]CP-55,940 from human CB2 receptor expressed in CHO cell membranes after 60 mins by scintillation counting analysis
Eur J Med Chem 113: 11-27 (2016)
BindingDB Entry DOI: 10.7270/Q21J9CPC
Cannabinoid receptor 1
(Homo sapiens (Human))
BDBM50154619
(CHEMBL3775966)
Show SMILES CCCCCn1cc(C(=O)NC2CCCCC2)c(=O)n2nc(nc12)-c1ccccc1
Show InChI InChI=1S/C23H29N5O2/c1-2-3-10-15-27-16-19(21(29)24-18-13-8-5-9-14-18)22(30)28-23(27)25-20(26-28)17-11-6-4-7-12-17/h4,6-7,11-12,16,18H,2-3,5,8-10,13-15H2,1H3,(H,24,29)
NCI pathway
Reactome pathway
3.21E+3n/an/an/an/an/an/an/an/a
Universit£ di Ferrara
Curated by ChEMBL
Assay Description
Displacement of [3H]CP-55,940 from human CB1 receptor expressed in CHO cell membranes after 90 mins by scintillation counting analysis
Eur J Med Chem 113: 11-27 (2016)
BindingDB Entry DOI: 10.7270/Q21J9CPC
Cannabinoid receptor 2
(Homo sapiens (Human))
BDBM50154619
(CHEMBL3775966)
Show SMILES CCCCCn1cc(C(=O)NC2CCCCC2)c(=O)n2nc(nc12)-c1ccccc1
Show InChI InChI=1S/C23H29N5O2/c1-2-3-10-15-27-16-19(21(29)24-18-13-8-5-9-14-18)22(30)28-23(27)25-20(26-28)17-11-6-4-7-12-17/h4,6-7,11-12,16,18H,2-3,5,8-10,13-15H2,1H3,(H,24,29)
Reactome pathway
n/an/an/an/a 756n/an/an/an/a
Universit£ di Ferrara
Curated by ChEMBL
Assay Description
Inverse agonist activity at human CB2 receptor transfected in CHO cells assessed as increase in forksolin stimulated cAMP production by scintillation...
Eur J Med Chem 113: 11-27 (2016)
BindingDB Entry DOI: 10.7270/Q21J9CPC
Cannabinoid receptor 2
(Homo sapiens (Human))
BDBM50154619
(CHEMBL3775966)
Show SMILES CCCCCn1cc(C(=O)NC2CCCCC2)c(=O)n2nc(nc12)-c1ccccc1
Show InChI InChI=1S/C23H29N5O2/c1-2-3-10-15-27-16-19(21(29)24-18-13-8-5-9-14-18)22(30)28-23(27)25-20(26-28)17-11-6-4-7-12-17/h4,6-7,11-12,16,18H,2-3,5,8-10,13-15H2,1H3,(H,24,29)
Reactome pathway
n/an/a 111n/an/an/an/an/an/a
Universit£ di Ferrara
Curated by ChEMBL
Assay Description
Antagonist activity at human CB2 receptor transfected in CHO cells assessed as inhibition of WIN 55,212-2 mediated suppression of forksolin induced c...
Eur J Med Chem 113: 11-27 (2016)
BindingDB Entry DOI: 10.7270/Q21J9CPC