BDBM50154838 CHEMBL3774790
SMILES: Cc1c(nnn1-c1ccccc1)C(=O)Nc1ccc(Oc2ccnc3[nH]ccc23)c(F)c1
InChI Key: InChIKey=ILHMGVBNWFPGAK-UHFFFAOYSA-N
Data: 1 IC50
Activity Spreadsheet -- Enzyme Inhibition Constant Data from BindingDB
Found 1 hit for monomerid = 50154838
Trg + Lig
Ki
nM
ΔG°
kcal/mole
IC50
nM
Kd
nM
EC50/IC50
nM
koff
s-1
kon
M-1s-1
pHTemp
°C
Hepatocyte growth factor receptor
(Homo sapiens (Human))
BDBM50154838
(CHEMBL3774790)
Show SMILES Cc1c(nnn1-c1ccccc1)C(=O)Nc1ccc(Oc2ccnc3[nH]ccc23)c(F)c1
Show InChI InChI=1S/C23H17FN6O2/c1-14-21(28-29-30(14)16-5-3-2-4-6-16)23(31)27-15-7-8-20(18(24)13-15)32-19-10-12-26-22-17(19)9-11-25-22/h2-13H,1H3,(H,25,26)(H,27,31)
n/an/a 17n/an/an/an/an/an/a
Jiangxi Science and Technology Normal University
Curated by ChEMBL
Assay Description
Inhibition of cMet (unknown origin) using poly (Glu, Tyr) 4:1 as substrate after 30 mins by HTRF assay
Bioorg Med Chem Lett 26: 1680-4 (2016)
BindingDB Entry DOI: 10.7270/Q2FF3V7R