BDBM50155538 CHEMBL183491::Sodium; formate::sodium formate
SMILES: [O-]C=O
InChI Key: InChIKey=BDAGIHXWWSANSR-UHFFFAOYSA-M
Data: 11 KI
Activity Spreadsheet -- Enzyme Inhibition Constant Data from BindingDB
Found 11 hits for monomerid = 50155538
Trg + Lig
Ki
nM
ΔG°
kcal/mole
IC50
nM
Kd
nM
EC50/IC50
nM
koff
s-1
kon
M-1s-1
pHTemp
°C
beta-Carbonic Anhydrase
(Candida albicans (Yeast))
BDBM50155538
(CHEMBL183491 | Sodium; formate | sodium formate)
Show SMILES [O-]C=O
Show InChI InChI=1S/CH2O2/c2-1-3/h1H,(H,2,3)/p-1
3.51E+4n/an/an/an/an/an/an/an/a
Università degli Studi di Firenze
Curated by ChEMBL
Assay Description
Inhibition of Candida albicans Nce103
Bioorg Med Chem 17: 2654-7 (2009)
Article DOI: 10.1016/j.bmc.2009.02.058
BindingDB Entry DOI: 10.7270/Q2TD9X8C
β-Carbonic anhydrase (CA1)
(Flaveria bidentis (Coastal plain yellowtops))
BDBM50155538
(CHEMBL183491 | Sodium; formate | sodium formate)
Show SMILES [O-]C=O
Show InChI InChI=1S/CH2O2/c2-1-3/h1H,(H,2,3)/p-1
9.75E+4 -5.38n/an/an/an/an/a8.320
Istituto di Biostrutture e Bioimmagini-CNR
Assay Description
Inhibition constants of carboxylate inhibitors against F. bidentis CA I were determined by a stopped flow CO2 hydration assay at 20 °C.
J Enzyme Inhib Med Chem 29: 500-4 (2014)
Article DOI: 10.3109/14756366.2013.813942
BindingDB Entry DOI: 10.7270/Q2WD3ZGT
Carbonic anhydrase 1
(Homo sapiens (Human))
BDBM50155538
(CHEMBL183491 | Sodium; formate | sodium formate)
Show SMILES [O-]C=O
Show InChI InChI=1S/CH2O2/c2-1-3/h1H,(H,2,3)/p-1
NCI pathway
Reactome pathway
1.04E+6n/an/an/an/an/an/an/an/a
Universit£ degli Studi di Firenze
Curated by ChEMBL
Assay Description
Inhibition of human cytosolic carbonic anhydrase 1 by stopped flow CO2 hydration assay
Bioorg Med Chem Lett 21: 2521-6 (2011)
Article DOI: 10.1016/j.bmcl.2011.02.057
BindingDB Entry DOI: 10.7270/Q2X63N76
Carbonic anhydrase 9
(Homo sapiens (Human))
BDBM50155538
(CHEMBL183491 | Sodium; formate | sodium formate)
Show SMILES [O-]C=O
Show InChI InChI=1S/CH2O2/c2-1-3/h1H,(H,2,3)/p-1
NCI pathway
Reactome pathway
1.22E+6n/an/an/an/an/an/an/an/a
Università degli Studi di Milano
Curated by ChEMBL
Assay Description
Inhibition constant of anion against human carbonic anhydrase isozyme hCA IX
Bioorg Med Chem Lett 14: 5763-7 (2004)
Article DOI: 10.1016/j.bmcl.2004.09.064
BindingDB Entry DOI: 10.7270/Q2V40TPN
Carbonic anhydrase 9
(Homo sapiens (Human))
BDBM50155538
(CHEMBL183491 | Sodium; formate | sodium formate)
Show SMILES [O-]C=O
Show InChI InChI=1S/CH2O2/c2-1-3/h1H,(H,2,3)/p-1
NCI pathway
Reactome pathway
1.22E+6n/an/an/an/an/an/an/an/a
Università degli Studi di Firenze
Curated by ChEMBL
Assay Description
Binding affinity against human cytosolic Carbonic anhydrase IX
Bioorg Med Chem Lett 15: 573-8 (2005)
Article DOI: 10.1016/j.bmcl.2004.11.057
BindingDB Entry DOI: 10.7270/Q2TH8M6D
Carbonic anhydrase 4
(Homo sapiens (Human))
BDBM50155538
(CHEMBL183491 | Sodium; formate | sodium formate)
Show SMILES [O-]C=O
Show InChI InChI=1S/CH2O2/c2-1-3/h1H,(H,2,3)/p-1
Reactome pathway
1.25E+6n/an/an/an/an/an/an/an/a
Università degli Studi di Firenze
Curated by ChEMBL
Assay Description
Binding affinity against human cytosolic Carbonic anhydrase IV
Bioorg Med Chem Lett 15: 573-8 (2005)
Article DOI: 10.1016/j.bmcl.2004.11.057
BindingDB Entry DOI: 10.7270/Q2TH8M6D
Carbonic anhydrase 4
(Homo sapiens (Human))
BDBM50155538
(CHEMBL183491 | Sodium; formate | sodium formate)
Show SMILES [O-]C=O
Show InChI InChI=1S/CH2O2/c2-1-3/h1H,(H,2,3)/p-1
Reactome pathway
1.25E+6n/an/an/an/an/an/an/an/a
Università degli Studi di Milano
Curated by ChEMBL
Assay Description
Inhibition constant of anion against human carbonic anhydrase isozyme hCA IV
Bioorg Med Chem Lett 14: 5763-7 (2004)
Article DOI: 10.1016/j.bmcl.2004.09.064
BindingDB Entry DOI: 10.7270/Q2V40TPN
Carbonic Anhydrase VA
(Homo sapiens (Human))
BDBM50155538
(CHEMBL183491 | Sodium; formate | sodium formate)
Show SMILES [O-]C=O
Show InChI InChI=1S/CH2O2/c2-1-3/h1H,(H,2,3)/p-1
Reactome pathway
9.97E+6n/an/an/an/an/an/an/an/a
Università degli Studi di Firenze
Curated by ChEMBL
Assay Description
Binding affinity against human cytosolic Carbonic anhydrase V
Bioorg Med Chem Lett 15: 573-8 (2005)
Article DOI: 10.1016/j.bmcl.2004.11.057
BindingDB Entry DOI: 10.7270/Q2TH8M6D
Carbonic anhydrase 2
(Homo sapiens (Human))
BDBM50155538
(CHEMBL183491 | Sodium; formate | sodium formate)
Show SMILES [O-]C=O
Show InChI InChI=1S/CH2O2/c2-1-3/h1H,(H,2,3)/p-1
Reactome pathway
2.40E+7n/an/an/an/an/an/an/an/a
Università degli Studi di Firenze
Curated by ChEMBL
Assay Description
Binding affinity against human cytosolic Carbonic anhydrase II
Bioorg Med Chem Lett 15: 573-8 (2005)
Article DOI: 10.1016/j.bmcl.2004.11.057
BindingDB Entry DOI: 10.7270/Q2TH8M6D
Carbonic anhydrase 2
(Homo sapiens (Human))
BDBM50155538
(CHEMBL183491 | Sodium; formate | sodium formate)
Show SMILES [O-]C=O
Show InChI InChI=1S/CH2O2/c2-1-3/h1H,(H,2,3)/p-1
Reactome pathway
2.40E+7n/an/an/an/an/an/an/an/a
Università degli Studi di Milano
Curated by ChEMBL
Assay Description
Inhibition constant of anion against human carbonic anhydrase isozyme hCA II
Bioorg Med Chem Lett 14: 5763-7 (2004)
Article DOI: 10.1016/j.bmcl.2004.09.064
BindingDB Entry DOI: 10.7270/Q2V40TPN
Carbonic anhydrase 2
(Homo sapiens (Human))
BDBM50155538
(CHEMBL183491 | Sodium; formate | sodium formate)
Show SMILES [O-]C=O
Show InChI InChI=1S/CH2O2/c2-1-3/h1H,(H,2,3)/p-1
Reactome pathway
2.40E+7n/an/an/an/an/an/an/an/a
Università degli Studi di Firenze
Curated by ChEMBL
Assay Description
Inhibition of human carbonic anhydrase2
Bioorg Med Chem 17: 2654-7 (2009)
Article DOI: 10.1016/j.bmc.2009.02.058
BindingDB Entry DOI: 10.7270/Q2TD9X8C