null
SMILES: CC(C)CC(=O)c1ccc(OCCCCOc2cccnc2)c(C)c1O
InChI Key: InChIKey=UKAJWUIHQGXPJH-UHFFFAOYSA-N
Activity Spreadsheet -- Enzyme Inhibition Constant Data from BindingDB
Found 1 hit for monomerid = 50155700
Trg + Lig
Ki
nM
ΔG°
kcal/mole
IC50
nM
Kd
nM
EC50/IC50
nM
koff
s-1
kon
M-1s-1
pHTemp
°C
Metabotropic glutamate receptor 2
(Homo sapiens (Human))
BDBM50155700
(1-{2-Hydroxy-3-methyl-4-[4-(pyridin-3-yloxy)-butox...)
Show SMILES CC(C)CC(=O)c1ccc(OCCCCOc2cccnc2)c(C)c1O
Show InChI InChI=1S/C21H27NO4/c1-15(2)13-19(23)18-8-9-20(16(3)21(18)24)26-12-5-4-11-25-17-7-6-10-22-14-17/h6-10,14-15,24H,4-5,11-13H2,1-3H3
n/an/an/an/a 1.72E+3n/an/an/an/a
Merck Research Laboratories
Curated by ChEMBL
Assay Description
Binding affinity towards human metabotropic glutamate receptor 2 determined by [35S]-GTP gama S binding assay
Bioorg Med Chem Lett 14: 5867-72 (2004)
Article DOI: 10.1016/j.bmcl.2004.09.028
BindingDB Entry DOI: 10.7270/Q2XW4J94