BDBM50155746 CHEMBL3781151
SMILES: COc1ccccc1N1CCN(CC1)c1ncnc2n(ncc12)-c1ccc(F)cc1
InChI Key: InChIKey=DBMPNCBTGSGUJB-UHFFFAOYSA-N
Data: 3 IC50
Activity Spreadsheet -- Enzyme Inhibition Constant Data from BindingDB
Found 3 hits for monomerid = 50155746
Trg + Lig
Ki
nM
ΔG°
kcal/mole
IC50
nM
Kd
nM
EC50/IC50
nM
koff
s-1
kon
M-1s-1
pHTemp
°C
Solute carrier family 2, facilitated glucose transporter member 2
(Homo sapiens (Human))
BDBM50155746
(CHEMBL3781151)
Show SMILES COc1ccccc1N1CCN(CC1)c1ncnc2n(ncc12)-c1ccc(F)cc1
Show InChI InChI=1S/C22H21FN6O/c1-30-20-5-3-2-4-19(20)27-10-12-28(13-11-27)21-18-14-26-29(22(18)25-15-24-21)17-8-6-16(23)7-9-17/h2-9,14-15H,10-13H2,1H3
NCI pathway
Reactome pathway
n/an/a>1.00E+4n/an/an/an/an/an/a
Bayer Pharma AG
Curated by ChEMBL
Assay Description
Inhibition of human GLUT2 expressed in CHO cells assessed as ATP production co-incubated with 30 mM fructose for 16 hrs by CellTiter-Glo assay in pre...
Bioorg Med Chem Lett 26: 1732-7 (2016)
BindingDB Entry DOI: 10.7270/Q2639RM3
Glucose transporter
(Homo sapiens (Human))
BDBM50155746
(CHEMBL3781151)
Show SMILES COc1ccccc1N1CCN(CC1)c1ncnc2n(ncc12)-c1ccc(F)cc1
Show InChI InChI=1S/C22H21FN6O/c1-30-20-5-3-2-4-19(20)27-10-12-28(13-11-27)21-18-14-26-29(22(18)25-15-24-21)17-8-6-16(23)7-9-17/h2-9,14-15H,10-13H2,1H3
n/an/a 17n/an/an/an/an/an/a
Bayer Pharma AG
Curated by ChEMBL
Assay Description
Inhibition of human GLUT1 expressed in DLD1 cells assessed as ATP production co-incubated with 100 mM glucose for 16 hrs by CellTiter-Glo assay in pr...
Bioorg Med Chem Lett 26: 1732-7 (2016)
BindingDB Entry DOI: 10.7270/Q2639RM3
Solute carrier family 2, facilitated glucose transporter member 3
(Homo sapiens (Human))
BDBM50155746
(CHEMBL3781151)
Show SMILES COc1ccccc1N1CCN(CC1)c1ncnc2n(ncc12)-c1ccc(F)cc1
Show InChI InChI=1S/C22H21FN6O/c1-30-20-5-3-2-4-19(20)27-10-12-28(13-11-27)21-18-14-26-29(22(18)25-15-24-21)17-8-6-16(23)7-9-17/h2-9,14-15H,10-13H2,1H3
n/an/a 46n/an/an/an/an/an/a
Bayer Pharma AG
Curated by ChEMBL
Assay Description
Inhibition of human GLUT3 expressed in GLUT1 knock-out DLD1 cells assessed as ATP production co-incubated with 300 mM glucose for 16 hrs by CellTiter...
Bioorg Med Chem Lett 26: 1732-7 (2016)
BindingDB Entry DOI: 10.7270/Q2639RM3