BDBM50155814 4-[1-(3-5,6,7,8-Tetrahydro-[1,8]naphthyridin-2-yl-propionyl)-piperidin-4-yl]-3-(1,2,3,4-tetrahydro-quinolin-3-yl)-butyric acid::CHEMBL185666
SMILES: OC(=O)CC(CC1CCN(CC1)C(=O)CCc1ccc2CCCNc2n1)C1CNc2ccccc2C1
InChI Key: InChIKey=AJVBWPQQXWRZHQ-UHFFFAOYSA-N
Data: 3 IC50
Activity Spreadsheet -- Enzyme Inhibition Constant Data from BindingDB
Found 3 hits for monomerid = 50155814
Trg + Lig
Ki
nM
ΔG°
kcal/mole
IC50
nM
Kd
nM
EC50/IC50
nM
koff
s-1
kon
M-1s-1
pHTemp
°C
ITGAV/ITGB3
(Homo sapiens (Human))
BDBM50155814
(4-[1-(3-5,6,7,8-Tetrahydro-[1,8]naphthyridin-2-yl-...)
Show SMILES OC(=O)CC(CC1CCN(CC1)C(=O)CCc1ccc2CCCNc2n1)C1CNc2ccccc2C1
Show InChI InChI=1S/C29H38N4O3/c34-27(10-9-25-8-7-21-5-3-13-30-29(21)32-25)33-14-11-20(12-15-33)16-23(18-28(35)36)24-17-22-4-1-2-6-26(22)31-19-24/h1-2,4,6-8,20,23-24,31H,3,5,9-19H2,(H,30,32)(H,35,36)
n/an/a 2.5n/an/an/an/an/an/a
Johnson & Johnson Pharmaceutical Research & Development
Curated by ChEMBL
Assay Description
Inhibitory concentration for human vitronectin binding to immobilized alphaV-beta3 integrin
Bioorg Med Chem Lett 14: 5937-41 (2004)
Article DOI: 10.1016/j.bmcl.2004.08.067
BindingDB Entry DOI: 10.7270/Q2DZ07S6
Integrin alpha-IIb/beta-3
(Homo sapiens (Human))
BDBM50155814
(4-[1-(3-5,6,7,8-Tetrahydro-[1,8]naphthyridin-2-yl-...)
Show SMILES OC(=O)CC(CC1CCN(CC1)C(=O)CCc1ccc2CCCNc2n1)C1CNc2ccccc2C1
Show InChI InChI=1S/C29H38N4O3/c34-27(10-9-25-8-7-21-5-3-13-30-29(21)32-25)33-14-11-20(12-15-33)16-23(18-28(35)36)24-17-22-4-1-2-6-26(22)31-19-24/h1-2,4,6-8,20,23-24,31H,3,5,9-19H2,(H,30,32)(H,35,36)
n/an/a 1.40E+4n/an/an/an/an/an/a
Johnson & Johnson Pharmaceutical Research & Development
Curated by ChEMBL
Assay Description
Inhibitory concentration for biotinylated fibrinogen binding to immobilized alpha IIb beta3 integrin
Bioorg Med Chem Lett 14: 5937-41 (2004)
Article DOI: 10.1016/j.bmcl.2004.08.067
BindingDB Entry DOI: 10.7270/Q2DZ07S6
ITGAV/ITGB5
(Homo sapiens (Human))
BDBM50155814
(4-[1-(3-5,6,7,8-Tetrahydro-[1,8]naphthyridin-2-yl-...)
Show SMILES OC(=O)CC(CC1CCN(CC1)C(=O)CCc1ccc2CCCNc2n1)C1CNc2ccccc2C1
Show InChI InChI=1S/C29H38N4O3/c34-27(10-9-25-8-7-21-5-3-13-30-29(21)32-25)33-14-11-20(12-15-33)16-23(18-28(35)36)24-17-22-4-1-2-6-26(22)31-19-24/h1-2,4,6-8,20,23-24,31H,3,5,9-19H2,(H,30,32)(H,35,36)
NCI pathway
Reactome pathway
n/an/a 17n/an/an/an/an/an/a
Johnson & Johnson Pharmaceutical Research & Development
Curated by ChEMBL
Assay Description
Inhibitory concentration for human vitronectin binding to immobilized alphaV-beta5 integrin
Bioorg Med Chem Lett 14: 5937-41 (2004)
Article DOI: 10.1016/j.bmcl.2004.08.067
BindingDB Entry DOI: 10.7270/Q2DZ07S6