BDBM50156131 CHEMBL3780089
SMILES: CNC(=O)c1cc(CCOc2ccc(NC(=O)Nc3cc(nn3-c3ccc(C)cc3)C(C)(C)C)c3ccccc23)ccn1
InChI Key: InChIKey=LSTJDRAIGHTXFW-UHFFFAOYSA-N
Data: 3 IC50
Activity Spreadsheet -- Enzyme Inhibition Constant Data from BindingDB
Found 3 hits for monomerid = 50156131
Trg + Lig
Ki
nM
ΔG°
kcal/mole
IC50
nM
Kd
nM
EC50/IC50
nM
koff
s-1
kon
M-1s-1
pHTemp
°C
Mitogen-activated protein kinase 12
(Homo sapiens (Human))
BDBM50156131
(CHEMBL3780089)
Show SMILES CNC(=O)c1cc(CCOc2ccc(NC(=O)Nc3cc(nn3-c3ccc(C)cc3)C(C)(C)C)c3ccccc23)ccn1
Show InChI InChI=1S/C34H36N6O3/c1-22-10-12-24(13-11-22)40-31(21-30(39-40)34(2,3)4)38-33(42)37-27-14-15-29(26-9-7-6-8-25(26)27)43-19-17-23-16-18-36-28(20-23)32(41)35-5/h6-16,18,20-21H,17,19H2,1-5H3,(H,35,41)(H2,37,38,42)
Reactome pathway
n/an/a>1.70E+4n/an/an/an/an/an/a
Sygnature Discovery Limited
Curated by ChEMBL
Assay Description
Inhibitory concentration required for in vitro binding affinity to Nicotinic acetylcholine receptor alpha3-beta2 expressed on cell line sf 9 by using...
J Med Chem 59: 1727-46 (2016)
BindingDB Entry DOI: 10.7270/Q2319XRB
Mitogen-activated protein kinase 14
(Homo sapiens (Human))
BDBM50156131
(CHEMBL3780089)
Show SMILES CNC(=O)c1cc(CCOc2ccc(NC(=O)Nc3cc(nn3-c3ccc(C)cc3)C(C)(C)C)c3ccccc23)ccn1
Show InChI InChI=1S/C34H36N6O3/c1-22-10-12-24(13-11-22)40-31(21-30(39-40)34(2,3)4)38-33(42)37-27-14-15-29(26-9-7-6-8-25(26)27)43-19-17-23-16-18-36-28(20-23)32(41)35-5/h6-16,18,20-21H,17,19H2,1-5H3,(H,35,41)(H2,37,38,42)
NCI pathway
Reactome pathway
n/an/a 33n/an/an/an/an/an/a
Sygnature Discovery Limited
Curated by ChEMBL
Assay Description
Inhibition of human recombinant p38 alpha assessed as phosphorylation of MAPKAP-K2 preincubated for 2 hrs followed by FRET peptide and MAPKAP-K2 addi...
J Med Chem 59: 1727-46 (2016)
BindingDB Entry DOI: 10.7270/Q2319XRB
Tyrosine-protein kinase HCK
(Homo sapiens (Human))
BDBM50156131
(CHEMBL3780089)
Show SMILES CNC(=O)c1cc(CCOc2ccc(NC(=O)Nc3cc(nn3-c3ccc(C)cc3)C(C)(C)C)c3ccccc23)ccn1
Show InChI InChI=1S/C34H36N6O3/c1-22-10-12-24(13-11-22)40-31(21-30(39-40)34(2,3)4)38-33(42)37-27-14-15-29(26-9-7-6-8-25(26)27)43-19-17-23-16-18-36-28(20-23)32(41)35-5/h6-16,18,20-21H,17,19H2,1-5H3,(H,35,41)(H2,37,38,42)
Reactome pathway
n/an/a>1.70E+4n/an/an/an/an/an/a
Sygnature Discovery Limited
Curated by ChEMBL
Assay Description
Inhibition of HCK (unknown origin) preincubated for 2 hrs followed by FRET peptide addition measured after 1 hr by Z-LYTE assay
J Med Chem 59: 1727-46 (2016)
BindingDB Entry DOI: 10.7270/Q2319XRB